Login | Register For Free | Help
Search for: (Advanced)

Mailing List Archive: Zope: Dev

zope-tests - FAILED: 1, OK: 37, UNKNOWN: 2

 

 

Zope dev RSS feed   Index | Next | Previous | View Threaded


noreply at zope

May 1, 2012, 6:00 PM

Post #1 of 5 (313 views)
Permalink
zope-tests - FAILED: 1, OK: 37, UNKNOWN: 2

This is the summary for test reports received on the
zope-tests list between 2012-04-30 00:00:00 UTC and 2012-05-01 00:00:00 UTC:

See the footnotes for test reports of unsuccessful builds.

An up-to date view of the builders is also available in our
buildbot documentation:
http://docs.zope.org/zopetoolkit/process/buildbots.html#the-nightly-builds

Reports received
----------------

Bluebream / Python2.5.5 64bit linux
Bluebream / Python2.6.7 64bit linux
Bluebream / Python2.7.2 64bit linux
[1] UNKNOWN : winbot / ztk_dev py_265_win32
[2] UNKNOWN : winbot / ztk_dev py_265_win64
ZTK 1.0dev / Python2.4.6 Linux 64bit
ZTK 1.0dev / Python2.5.5 Linux 64bit
ZTK 1.0dev / Python2.6.7 Linux 64bit
ZTK 1.1 / Python2.5.5 Linux 64bit
ZTK 1.1 / Python2.6.7 Linux 64bit
ZTK 1.1 / Python2.7.2 Linux 64bit
ZTK 1.1dev / Python2.5.5 Linux 64bit
ZTK 1.1dev / Python2.6.7 Linux 64bit
[3] ZTK 1.1dev / Python2.7.2 Linux 64bit
Zope 3.4 Known Good Set / py2.4-32bit-linux
Zope 3.4 Known Good Set / py2.4-64bit-linux
Zope 3.4 Known Good Set / py2.5-32bit-linux
Zope 3.4 Known Good Set / py2.5-64bit-linux
Zope-2.10 Python-2.4.6 : Linux
Zope-2.11 Python-2.4.6 : Linux
Zope-2.12 Python-2.6.6 : Linux
Zope-2.12-alltests Python-2.6.6 : Linux
Zope-2.13 Python-2.6.6 : Linux
Zope-2.13-alltests Python-2.6.6 : Linux
Zope-trunk Python-2.6.6 : Linux
Zope-trunk-alltests Python-2.6.6 : Linux
winbot / ZODB_dev py_265_win32
winbot / ZODB_dev py_265_win64
winbot / ZODB_dev py_270_win32
winbot / ZODB_dev py_270_win64
winbot / ztk_10 py_254_win32
winbot / ztk_10 py_265_win32
winbot / ztk_10 py_265_win64
winbot / ztk_11 py_254_win32
winbot / ztk_11 py_265_win32
winbot / ztk_11 py_265_win64
winbot / ztk_11 py_270_win32
winbot / ztk_11 py_270_win64
winbot / ztk_dev py_270_win32
winbot / ztk_dev py_270_win64

Non-OK results
--------------

[1] UNKNOWN UNKNOWN : winbot / ztk_dev py_265_win32
https://mail.zope.org/pipermail/zope-tests/2012-May/061274.html


[2] UNKNOWN UNKNOWN : winbot / ztk_dev py_265_win64
https://mail.zope.org/pipermail/zope-tests/2012-May/061275.html


[3] FAILED ZTK 1.1dev / Python2.7.2 Linux 64bit
https://mail.zope.org/pipermail/zope-tests/2012-May/061255.html


_______________________________________________
Zope-Dev maillist - Zope-Dev [at] zope
https://mail.zope.org/mailman/listinfo/zope-dev
** No cross posts or HTML encoding! **
(Related lists -
https://mail.zope.org/mailman/listinfo/zope-announce
https://mail.zope.org/mailman/listinfo/zope )


mh at gocept

May 1, 2012, 11:24 PM

Post #2 of 5 (301 views)
Permalink
Re: zope-tests - FAILED: 1, OK: 37, UNKNOWN: 2 [In reply to]

Am 02.05.2012 um 03:00 schrieb Zope tests summarizer:
> Non-OK results
> --------------
>
> [1] UNKNOWN UNKNOWN : winbot / ztk_dev py_265_win32
> https://mail.zope.org/pipermail/zope-tests/2012-May/061274.html
> [2] UNKNOWN UNKNOWN : winbot / ztk_dev py_265_win64
> https://mail.zope.org/pipermail/zope-tests/2012-May/061275.html

Still this strange error during first phase: svn (seems to do a "rm -r" and "svn checkout")

File "c:\python25_sys\lib\site-packages\buildbot-0.8.0-py2.5.egg\buildbot\slave\commands\utils.py", line 53, in rmdirRecursive
os.remove(full_name)
exceptions.WindowsError: [Error 5] Access is denied: 'c:\\buildslave\\ztk_dev_py_265_win64\\build\\bin\\test-zopeapp-zc.sourcefactory.exe'

Maybe a newer buildbot version could help on PyPI there is 0.8.6p1

> [3] FAILED ZTK 1.1dev / Python2.7.2 Linux 64bit
> https://mail.zope.org/pipermail/zope-tests/2012-May/061255.html

Timeout during buildout phase.



Yours sincerely,
--
Michael Howitz · mh [at] gocept · software developer
gocept gmbh & co. kg · Forsterstraße 29 · 06112 Halle (Saale) · Germany
http://gocept.com · tel +49 345 1229889 8 · fax +49 345 1229889 1
Python, Pyramid, Plone, Zope - consulting, development, hosting, operations

_______________________________________________
Zope-Dev maillist - Zope-Dev [at] zope
https://mail.zope.org/mailman/listinfo/zope-dev
** No cross posts or HTML encoding! **
(Related lists -
https://mail.zope.org/mailman/listinfo/zope-announce
https://mail.zope.org/mailman/listinfo/zope )


marius at gedmin

May 2, 2012, 6:31 AM

Post #3 of 5 (298 views)
Permalink
Re: zope-tests - FAILED: 1, OK: 37, UNKNOWN: 2 [In reply to]

On Wed, May 02, 2012 at 08:24:02AM +0200, Michael Howitz wrote:
> Am 02.05.2012 um 03:00 schrieb Zope tests summarizer:
> > Non-OK results
> > --------------
> >
> > [1] UNKNOWN UNKNOWN : winbot / ztk_dev py_265_win32
> > https://mail.zope.org/pipermail/zope-tests/2012-May/061274.html
> > [2] UNKNOWN UNKNOWN : winbot / ztk_dev py_265_win64
> > https://mail.zope.org/pipermail/zope-tests/2012-May/061275.html
>
> Still this strange error during first phase: svn (seems to do a "rm -r" and "svn checkout")
>
> File "c:\python25_sys\lib\site-packages\buildbot-0.8.0-py2.5.egg\buildbot\slave\commands\utils.py", line 53, in rmdirRecursive
> os.remove(full_name)
> exceptions.WindowsError: [Error 5] Access is denied: 'c:\\buildslave\\ztk_dev_py_265_win64\\build\\bin\\test-zopeapp-zc.sourcefactory.exe'

Could be a stuck process from an older test run?

Windows won't allow you to delete files that are currently in use (e.g.
programs that are now being executed).

> Maybe a newer buildbot version could help on PyPI there is 0.8.6p1

(I've a feeling it won't help, but no evidence to substantiate that
feeling.)

Marius Gedminas
--
http://pov.lt/ -- Zope 3/BlueBream consulting and development
Attachments: signature.asc (0.19 KB)


agroszer.ll at gmail

May 2, 2012, 6:40 AM

Post #4 of 5 (297 views)
Permalink
Re: zope-tests - FAILED: 1, OK: 37, UNKNOWN: 2 [In reply to]

On 05/02/2012 03:31 PM, Marius Gedminas wrote:
> On Wed, May 02, 2012 at 08:24:02AM +0200, Michael Howitz wrote:
>> Am 02.05.2012 um 03:00 schrieb Zope tests summarizer:
>>> Non-OK results
>>> --------------
>>>
>>> [1] UNKNOWN UNKNOWN : winbot / ztk_dev py_265_win32
>>> https://mail.zope.org/pipermail/zope-tests/2012-May/061274.html
>>> [2] UNKNOWN UNKNOWN : winbot / ztk_dev py_265_win64
>>> https://mail.zope.org/pipermail/zope-tests/2012-May/061275.html
>>
>> Still this strange error during first phase: svn (seems to do a "rm -r" and "svn checkout")
>>
>> File "c:\python25_sys\lib\site-packages\buildbot-0.8.0-py2.5.egg\buildbot\slave\commands\utils.py", line 53, in rmdirRecursive
>> os.remove(full_name)
>> exceptions.WindowsError: [Error 5] Access is denied: 'c:\\buildslave\\ztk_dev_py_265_win64\\build\\bin\\test-zopeapp-zc.sourcefactory.exe'
>
> Could be a stuck process from an older test run?
>
> Windows won't allow you to delete files that are currently in use (e.g.
> programs that are now being executed).
>
>> Maybe a newer buildbot version could help on PyPI there is 0.8.6p1
>
> (I've a feeling it won't help, but no evidence to substantiate that
> feeling.)
>

Someone would need to figure why that test/process gets stuck
(test-zopeapp-zc.sourcefactory.exe itself)
or why that package gets included

--
Best regards,
Adam GROSZER
--
Quote of the day:
The lure of the distant and the difficult is deceptive. The great
opportunity is where you are. (John Burroughs)
_______________________________________________
Zope-Dev maillist - Zope-Dev [at] zope
https://mail.zope.org/mailman/listinfo/zope-dev
** No cross posts or HTML encoding! **
(Related lists -
https://mail.zope.org/mailman/listinfo/zope-announce
https://mail.zope.org/mailman/listinfo/zope )


hanno at hannosch

May 2, 2012, 6:58 AM

Post #5 of 5 (298 views)
Permalink
Re: zope-tests - FAILED: 1, OK: 37, UNKNOWN: 2 [In reply to]

On Wed, May 2, 2012 at 3:40 PM, Adam GROSZER <agroszer.ll [at] gmail> wrote:
> or why that package gets included

Adding zc.sourcefactory to the ZTK was a conscious choice. It was
popular and often used in "Zope 3"-style projects, maybe even part of
core Grok and BlueBream.

We could remove it from ZTK 1.2, but cannot just drop it from the
stable 1.0 and 1.1 series.

Hanno
_______________________________________________
Zope-Dev maillist - Zope-Dev [at] zope
https://mail.zope.org/mailman/listinfo/zope-dev
** No cross posts or HTML encoding! **
(Related lists -
https://mail.zope.org/mailman/listinfo/zope-announce
https://mail.zope.org/mailman/listinfo/zope )

Zope dev RSS feed   Index | Next | Previous | View Threaded
 
 


Interested in having your list archived? Contact Gossamer Threads
 
  Web Applications & Managed Hosting Powered by Gossamer Threads Inc.