Login | Register For Free | Help
Search for: (Advanced)

Mailing List Archive: Zope: Dev

zope-tests - FAILED: 6, OK: 33, UNKNOWN: 2

 

 

Zope dev RSS feed   Index | Next | Previous | View Threaded


noreply at zope

Apr 19, 2012, 6:00 PM

Post #1 of 3 (276 views)
Permalink
zope-tests - FAILED: 6, OK: 33, UNKNOWN: 2

This is the summary for test reports received on the
zope-tests list between 2012-04-18 00:00:00 UTC and 2012-04-19 00:00:00 UTC:

See the footnotes for test reports of unsuccessful builds.

An up-to date view of the builders is also available in our
buildbot documentation:
http://docs.zope.org/zopetoolkit/process/buildbots.html#the-nightly-builds

Reports received
----------------

Bluebream / Python2.5.5 64bit linux
Bluebream / Python2.6.7 64bit linux
Bluebream / Python2.7.2 64bit linux
[1] UNKNOWN : winbot / ztk_dev py_265_win32
[2] UNKNOWN : winbot / ztk_dev py_265_win64
[3] ZTK 1.0dev / Python2.4.6 Linux 64bit
[4] ZTK 1.0dev / Python2.5.5 Linux 64bit
[5] ZTK 1.0dev / Python2.6.7 Linux 64bit
ZTK 1.1 / Python2.5.5 Linux 64bit
ZTK 1.1 / Python2.6.7 Linux 64bit
ZTK 1.1 / Python2.7.2 Linux 64bit
[6] ZTK 1.1dev / Python2.5.5 Linux 64bit
[7] ZTK 1.1dev / Python2.6.7 Linux 64bit
[8] ZTK 1.1dev / Python2.7.2 Linux 64bit
Zope 3.4 Known Good Set / py2.4-32bit-linux
Zope 3.4 Known Good Set / py2.4-64bit-linux
Zope 3.4 Known Good Set / py2.5-32bit-linux
Zope 3.4 Known Good Set / py2.5-64bit-linux
Zope-2.10 Python-2.4.6 : Linux
Zope-2.11 Python-2.4.6 : Linux
Zope-2.12 Python-2.6.6 : Linux
Zope-2.12-alltests Python-2.6.6 : Linux
Zope-2.13 Python-2.6.6 : Linux
Zope-2.13-alltests Python-2.6.6 : Linux
Zope-trunk Python-2.6.6 : Linux
Zope-trunk-alltests Python-2.6.6 : Linux
winbot / ZODB_dev py_265_win32
winbot / ZODB_dev py_265_win64
winbot / ZODB_dev py_265_win64
winbot / ZODB_dev py_270_win32
winbot / ZODB_dev py_270_win64
winbot / ztk_10 py_254_win32
winbot / ztk_10 py_265_win32
winbot / ztk_10 py_265_win64
winbot / ztk_11 py_254_win32
winbot / ztk_11 py_265_win32
winbot / ztk_11 py_265_win64
winbot / ztk_11 py_270_win32
winbot / ztk_11 py_270_win64
winbot / ztk_dev py_270_win32
winbot / ztk_dev py_270_win64

Non-OK results
--------------

[1] UNKNOWN UNKNOWN : winbot / ztk_dev py_265_win32
https://mail.zope.org/pipermail/zope-tests/2012-April/060785.html


[2] UNKNOWN UNKNOWN : winbot / ztk_dev py_265_win64
https://mail.zope.org/pipermail/zope-tests/2012-April/060786.html


[3] FAILED ZTK 1.0dev / Python2.4.6 Linux 64bit
https://mail.zope.org/pipermail/zope-tests/2012-April/060768.html


[4] FAILED ZTK 1.0dev / Python2.5.5 Linux 64bit
https://mail.zope.org/pipermail/zope-tests/2012-April/060769.html


[5] FAILED ZTK 1.0dev / Python2.6.7 Linux 64bit
https://mail.zope.org/pipermail/zope-tests/2012-April/060767.html


[6] FAILED ZTK 1.1dev / Python2.5.5 Linux 64bit
https://mail.zope.org/pipermail/zope-tests/2012-April/060764.html


[7] FAILED ZTK 1.1dev / Python2.6.7 Linux 64bit
https://mail.zope.org/pipermail/zope-tests/2012-April/060765.html


[8] FAILED ZTK 1.1dev / Python2.7.2 Linux 64bit
https://mail.zope.org/pipermail/zope-tests/2012-April/060766.html


_______________________________________________
Zope-Dev maillist - Zope-Dev [at] zope
https://mail.zope.org/mailman/listinfo/zope-dev
** No cross posts or HTML encoding! **
(Related lists -
https://mail.zope.org/mailman/listinfo/zope-announce
https://mail.zope.org/mailman/listinfo/zope )


tseaver at palladion

Apr 19, 2012, 7:03 PM

Post #2 of 3 (270 views)
Permalink
Re: zope-tests - FAILED: 6, OK: 33, UNKNOWN: 2 [In reply to]

-----BEGIN PGP SIGNED MESSAGE-----
Hash: SHA1

On 04/19/2012 09:00 PM, Zope tests summarizer wrote:
> [1] UNKNOWN UNKNOWN : winbot / ztk_dev py_265_win32
> https://mail.zope.org/pipermail/zope-tests/2012-April/060785.html


Hmm, this is an odd one. It blows up in the 'svn' step::

File
"c:\python25_sys\lib\site-packages\buildbot-0.8.0-py2.5.egg\buildbot\slave\commands\utils.py",
line 53, in rmdirRecursive
os.remove(full_name)
exceptions.WindowsError: [Error 5] Access is denied:
'c:\\buildslave\\ztk_dev_py_265_win32\\build\\bin\\test-zopeapp-zc.sourcefactory.exe


> [2] UNKNOWN UNKNOWN : winbot / ztk_dev py_265_win64
> https://mail.zope.org/pipermail/zope-tests/2012-April/060786.html


Ditto. Maybe that box needs an intervention?


> [3] FAILED ZTK 1.0dev / Python2.4.6 Linux 64bit
> https://mail.zope.org/pipermail/zope-tests/2012-April/060768.html
>
>
> [4] FAILED ZTK 1.0dev / Python2.5.5 Linux 64bit
> https://mail.zope.org/pipermail/zope-tests/2012-April/060769.html
>
>
> [5] FAILED ZTK 1.0dev / Python2.6.7 Linux 64bit
> https://mail.zope.org/pipermail/zope-tests/2012-April/060767.html
>
>
> [6] FAILED ZTK 1.1dev / Python2.5.5 Linux 64bit
> https://mail.zope.org/pipermail/zope-tests/2012-April/060764.html
>
>
> [7] FAILED ZTK 1.1dev / Python2.6.7 Linux 64bit
> https://mail.zope.org/pipermail/zope-tests/2012-April/060765.html
>
>
> [8] FAILED ZTK 1.1dev / Python2.7.2 Linux 64bit
> https://mail.zope.org/pipermail/zope-tests/2012-April/060766.html


These are all the same repoze.sphinx.autointerface issue I fixed this
afternoon.



Tres.
- --
===================================================================
Tres Seaver +1 540-429-0999 tseaver [at] palladion
Palladion Software "Excellence by Design" http://palladion.com
-----BEGIN PGP SIGNATURE-----
Version: GnuPG v1.4.10 (GNU/Linux)
Comment: Using GnuPG with Mozilla - http://enigmail.mozdev.org/

iEYEARECAAYFAk+Qw/wACgkQ+gerLs4ltQ7ZWwCfQ3Fkl4NsHSvr9ql3ySEe5FAG
xRoAoI711GTQ2M3YRW4OXeIXF2s1nzDH
=0v7e
-----END PGP SIGNATURE-----

_______________________________________________
Zope-Dev maillist - Zope-Dev [at] zope
https://mail.zope.org/mailman/listinfo/zope-dev
** No cross posts or HTML encoding! **
(Related lists -
https://mail.zope.org/mailman/listinfo/zope-announce
https://mail.zope.org/mailman/listinfo/zope )


hanno at hannosch

Apr 20, 2012, 5:35 AM

Post #3 of 3 (267 views)
Permalink
Re: zope-tests - FAILED: 6, OK: 33, UNKNOWN: 2 [In reply to]

On Fri, Apr 20, 2012 at 4:03 AM, Tres Seaver <tseaver [at] palladion> wrote:
> On 04/19/2012 09:00 PM, Zope tests summarizer wrote:
>> [2]    UNKNOWN UNKNOWN : winbot / ztk_dev py_265_win64
>> https://mail.zope.org/pipermail/zope-tests/2012-April/060786.html
>
> Ditto.  Maybe that box needs an intervention?

Yep. There were some hanging processes. I killed them all, cleaned the
build folder and am restarting the box now.

Should be better tomorrow,
Hanno
_______________________________________________
Zope-Dev maillist - Zope-Dev [at] zope
https://mail.zope.org/mailman/listinfo/zope-dev
** No cross posts or HTML encoding! **
(Related lists -
https://mail.zope.org/mailman/listinfo/zope-announce
https://mail.zope.org/mailman/listinfo/zope )

Zope dev RSS feed   Index | Next | Previous | View Threaded
 
 


Interested in having your list archived? Contact Gossamer Threads
 
  Web Applications & Managed Hosting Powered by Gossamer Threads Inc.