Login | Register For Free | Help
Search for: (Advanced)

Mailing List Archive: SpamAssassin: devel

Build failed in Jenkins: SpamAssassin-trunk #7665

 

 

SpamAssassin devel RSS feed   Index | Next | Previous | View Threaded


jenkins at builds

Feb 15, 2012, 4:48 AM

Post #1 of 1 (143 views)
Permalink
Build failed in Jenkins: SpamAssassin-trunk #7665

See <https://builds.apache.org/job/SpamAssassin-trunk/7665/>

------------------------------------------
Started by an SCM change
Building remotely on solaris1 in workspace <https://builds.apache.org/job/SpamAssassin-trunk/ws/>
hudson.util.IOException2: remote file operation failed: <https://builds.apache.org/job/SpamAssassin-trunk/ws/> at hudson.remoting.Channel [at] 1c8addb:solaris1
at hudson.FilePath.act(FilePath.java:784)
at hudson.FilePath.act(FilePath.java:770)
at hudson.scm.SubversionSCM.checkout(SubversionSCM.java:742)
at hudson.scm.SubversionSCM.checkout(SubversionSCM.java:684)
at hudson.model.AbstractProject.checkout(AbstractProject.java:1195)
at hudson.model.AbstractBuild$AbstractRunner.checkout(AbstractBuild.java:576)
at hudson.model.AbstractBuild$AbstractRunner.run(AbstractBuild.java:465)
at hudson.model.Run.run(Run.java:1409)
at hudson.model.FreeStyleBuild.run(FreeStyleBuild.java:46)
at hudson.model.ResourceController.execute(ResourceController.java:88)
at hudson.model.Executor.run(Executor.java:238)
Caused by: java.io.IOException: Remote call on solaris1 failed
at hudson.remoting.Channel.call(Channel.java:690)
at hudson.FilePath.act(FilePath.java:777)
... 10 more
Caused by: java.lang.ClassFormatError: Failed to load javax.servlet.ServletException
at hudson.remoting.RemoteClassLoader.loadClassFile(RemoteClassLoader.java:154)
at hudson.remoting.RemoteClassLoader.findClass(RemoteClassLoader.java:131)
at java.lang.ClassLoader.loadClass(ClassLoader.java:307)
at java.lang.ClassLoader.loadClass(ClassLoader.java:252)
at java.lang.ClassLoader.loadClassInternal(ClassLoader.java:320)
at hudson.scm.SubversionWorkspaceSelector.syncWorkspaceFormatFromMaster(SubversionWorkspaceSelector.java:85)
at hudson.scm.SubversionSCM.createSvnClientManager(SubversionSCM.java:822)
at hudson.scm.SubversionSCM$CheckOutTask.invoke(SubversionSCM.java:765)
at hudson.scm.SubversionSCM$CheckOutTask.invoke(SubversionSCM.java:752)
at hudson.FilePath$FileCallableWrapper.call(FilePath.java:2099)
at hudson.remoting.UserRequest.perform(UserRequest.java:118)
at hudson.remoting.UserRequest.perform(UserRequest.java:48)
at hudson.remoting.Request$2.run(Request.java:287)
at hudson.remoting.InterceptingExecutorService$1.call(InterceptingExecutorService.java:72)
at java.util.concurrent.FutureTask$Sync.innerRun(FutureTask.java:269)
at java.util.concurrent.FutureTask.run(FutureTask.java:123)
at java.util.concurrent.ThreadPoolExecutor$Worker.runTask(ThreadPoolExecutor.java:651)
at java.util.concurrent.ThreadPoolExecutor$Worker.run(ThreadPoolExecutor.java:676)
at java.lang.Thread.run(Thread.java:595)
Caused by: java.lang.UnsupportedClassVersionError: Bad version number in .class file
at java.lang.ClassLoader.defineClass1(Native Method)
at java.lang.ClassLoader.defineClass(ClassLoader.java:621)
at java.lang.ClassLoader.defineClass(ClassLoader.java:466)
at hudson.remoting.RemoteClassLoader.loadClassFile(RemoteClassLoader.java:152)
... 18 more
Recording test results
ERROR: Failed to archive test reports
hudson.util.IOException2: remote file operation failed: <https://builds.apache.org/job/SpamAssassin-trunk/ws/> at hudson.remoting.Channel [at] 1c8addb:solaris1
at hudson.FilePath.act(FilePath.java:784)
at hudson.FilePath.act(FilePath.java:770)
at hudson.tasks.junit.JUnitParser.parse(JUnitParser.java:83)
at hudson.tasks.junit.JUnitResultArchiver.parse(JUnitResultArchiver.java:122)
at hudson.tasks.junit.JUnitResultArchiver.perform(JUnitResultArchiver.java:134)
at hudson.tasks.BuildStepMonitor$1.perform(BuildStepMonitor.java:19)
at hudson.model.AbstractBuild$AbstractRunner.perform(AbstractBuild.java:700)
at hudson.model.AbstractBuild$AbstractRunner.performAllBuildSteps(AbstractBuild.java:675)
at hudson.model.AbstractBuild$AbstractRunner.performAllBuildSteps(AbstractBuild.java:653)
at hudson.model.Build$RunnerImpl.post2(Build.java:162)
at hudson.model.AbstractBuild$AbstractRunner.post(AbstractBuild.java:622)
at hudson.model.Run.run(Run.java:1434)
at hudson.model.FreeStyleBuild.run(FreeStyleBuild.java:46)
at hudson.model.ResourceController.execute(ResourceController.java:88)
at hudson.model.Executor.run(Executor.java:238)
Caused by: java.io.IOException: Remote call on solaris1 failed
at hudson.remoting.Channel.call(Channel.java:690)
at hudson.FilePath.act(FilePath.java:777)
... 14 more
Caused by: java.lang.ClassFormatError: Failed to load javax.servlet.ServletException
at hudson.remoting.RemoteClassLoader.loadClassFile(RemoteClassLoader.java:154)
at hudson.remoting.RemoteClassLoader.findClass(RemoteClassLoader.java:131)
at java.lang.ClassLoader.loadClass(ClassLoader.java:307)
at java.lang.ClassLoader.loadClass(ClassLoader.java:252)
at java.lang.ClassLoader.loadClassInternal(ClassLoader.java:320)
at hudson.tasks.junit.JUnitParser$ParseResultCallable.invoke(JUnitParser.java:114)
at hudson.tasks.junit.JUnitParser$ParseResultCallable.invoke(JUnitParser.java:87)
at hudson.FilePath$FileCallableWrapper.call(FilePath.java:2099)
at hudson.remoting.UserRequest.perform(UserRequest.java:118)
at hudson.remoting.UserRequest.perform(UserRequest.java:48)
at hudson.remoting.Request$2.run(Request.java:287)
at hudson.remoting.InterceptingExecutorService$1.call(InterceptingExecutorService.java:72)
at java.util.concurrent.FutureTask$Sync.innerRun(FutureTask.java:269)
at java.util.concurrent.FutureTask.run(FutureTask.java:123)
at java.util.concurrent.ThreadPoolExecutor$Worker.runTask(ThreadPoolExecutor.java:651)
at java.util.concurrent.ThreadPoolExecutor$Worker.run(ThreadPoolExecutor.java:676)
at java.lang.Thread.run(Thread.java:595)
Caused by: java.lang.UnsupportedClassVersionError: Bad version number in .class file
at java.lang.ClassLoader.defineClass1(Native Method)
at java.lang.ClassLoader.defineClass(ClassLoader.java:621)
at java.lang.ClassLoader.defineClass(ClassLoader.java:466)
at hudson.remoting.RemoteClassLoader.loadClassFile(RemoteClassLoader.java:152)
... 16 more
Archiving artifacts
ERROR: Failed to archive artifacts: sa_trunk/artifacts/**
hudson.util.IOException2: java.lang.ClassFormatError: Failed to load javax.servlet.ServletRequest
at hudson.FilePath.copyRecursiveTo(FilePath.java:1701)
at hudson.tasks.ArtifactArchiver.perform(ArtifactArchiver.java:116)
at hudson.tasks.BuildStepMonitor$1.perform(BuildStepMonitor.java:19)
at hudson.model.AbstractBuild$AbstractRunner.perform(AbstractBuild.java:700)
at hudson.model.AbstractBuild$AbstractRunner.performAllBuildSteps(AbstractBuild.java:675)
at hudson.model.AbstractBuild$AbstractRunner.performAllBuildSteps(AbstractBuild.java:653)
at hudson.model.Build$RunnerImpl.post2(Build.java:162)
at hudson.model.AbstractBuild$AbstractRunner.post(AbstractBuild.java:622)
at hudson.model.Run.run(Run.java:1434)
at hudson.model.FreeStyleBuild.run(FreeStyleBuild.java:46)
at hudson.model.ResourceController.execute(ResourceController.java:88)
at hudson.model.Executor.run(Executor.java:238)
Caused by: java.util.concurrent.ExecutionException: java.lang.ClassFormatError: Failed to load javax.servlet.ServletRequest
at hudson.remoting.Channel$2.adapt(Channel.java:714)
at hudson.remoting.Channel$2.adapt(Channel.java:709)
at hudson.remoting.FutureAdapter.get(FutureAdapter.java:55)
at hudson.FilePath.copyRecursiveTo(FilePath.java:1699)
... 11 more
Caused by: java.lang.ClassFormatError: Failed to load javax.servlet.ServletRequest
at hudson.remoting.RemoteClassLoader.loadClassFile(RemoteClassLoader.java:154)
at hudson.remoting.RemoteClassLoader.findClass(RemoteClassLoader.java:131)
at java.lang.ClassLoader.loadClass(ClassLoader.java:307)
at java.lang.ClassLoader.loadClass(ClassLoader.java:252)
at java.lang.ClassLoader.loadClassInternal(ClassLoader.java:320)
at hudson.util.io.TarArchiver.visit(TarArchiver.java:89)
at hudson.util.DirScanner$Glob.scan(DirScanner.java:104)
at hudson.FilePath.writeToTar(FilePath.java:1737)
at hudson.FilePath.access$1000(FilePath.java:164)
at hudson.FilePath$34.invoke(FilePath.java:1678)
at hudson.FilePath$34.invoke(FilePath.java:1675)
at hudson.FilePath$FileCallableWrapper.call(FilePath.java:2099)
at hudson.remoting.UserRequest.perform(UserRequest.java:118)
at hudson.remoting.UserRequest.perform(UserRequest.java:48)
at hudson.remoting.Request$2.run(Request.java:287)
at hudson.remoting.InterceptingExecutorService$1.call(InterceptingExecutorService.java:72)
at java.util.concurrent.FutureTask$Sync.innerRun(FutureTask.java:269)
at java.util.concurrent.FutureTask.run(FutureTask.java:123)
at java.util.concurrent.ThreadPoolExecutor$Worker.runTask(ThreadPoolExecutor.java:651)
at java.util.concurrent.ThreadPoolExecutor$Worker.run(ThreadPoolExecutor.java:676)
at java.lang.Thread.run(Thread.java:595)
Caused by: java.lang.UnsupportedClassVersionError: Bad version number in .class file
at java.lang.ClassLoader.defineClass1(Native Method)
at java.lang.ClassLoader.defineClass(ClassLoader.java:621)
at java.lang.ClassLoader.defineClass(ClassLoader.java:466)
at hudson.remoting.RemoteClassLoader.loadClassFile(RemoteClassLoader.java:152)
... 20 more

SpamAssassin devel RSS feed   Index | Next | Previous | View Threaded
 
 


Interested in having your list archived? Contact Gossamer Threads
 
  Web Applications & Managed Hosting Powered by Gossamer Threads Inc.