Login | Register For Free | Help
Search for: (Advanced)

Mailing List Archive: Perl: porters

Smoke [5.17.3] v5.17.2-274-g8a29383 FAIL(F) MSWin32 Win7 Home Premium (x86/8 cpu)

 

 

Perl porters RSS feed   Index | Next | Previous | View Threaded


steve.m.hay at googlemail

Aug 9, 2012, 3:07 PM

Post #1 of 1 (59 views)
Permalink
Smoke [5.17.3] v5.17.2-274-g8a29383 FAIL(F) MSWin32 Win7 Home Premium (x86/8 cpu)

Automated smoke report for 5.17.3 patch 8a2938341d31ca951f764ec0a05ab6ca6811b5e3 v5.17.2-274-g8a29383
HPWIN7: Intel64 Family 6 Model 42 Stepping 7, GenuineIntel (x86/8 cpu)
on MSWin32 - Win7 Home Premium (64-bit) SP1
using cl version 16.00.40219.01
smoketime 1 hour 6 minutes (average 33 minutes 7 seconds)

Summary: FAIL(F)

O = OK F = Failure(s), extended report at the bottom
X = Failure(s) under TEST but not under harness
? = still running or test results not (yet) available
Build failures during: - = unknown or N/A
c = Configure, m = make, M = make (after miniperl), t = make test-prep

v5.17.2-274-g8a29383 Configuration (common) -DCCTYPE=MSVC100
----------- ---------------------------------------------------------
F F -Duseithreads -Duselargefiles
| +--------- -DDEBUGGING
+----------- no debugging


Locally applied patches:
SMOKE85b769704171cb40faee0cdff60865fbf100c4c0

Failures: (common-args) -DCCTYPE=MSVC100
[default] -Duseithreads -Duselargefiles
./t/op/magic.t.............................................FAILED
154, 157
./dist/IO/t/io_sock.t......................................FAILED
25
Non-zero exit status: 54
Bad plan. You planned 26 tests but ran 25.
./ext/B/t/optree_misc.t....................................FAILED
8

[default] -DDEBUGGING -Duseithreads -Duselargefiles
./t/op/magic.t.............................................FAILED
154, 157
./ext/B/t/optree_misc.t....................................FAILED
8

MANIFEST did not declare '.GIT/CONFIG'
MANIFEST did not declare '.GIT/DESCRIPTION'
MANIFEST did not declare '.GIT/FETCH_HEAD'
MANIFEST did not declare '.GIT/HEAD'
MANIFEST did not declare '.GIT/HOOKS/APPLYPATCH-MSG.SAMPLE'
MANIFEST did not declare '.GIT/HOOKS/COMMIT-MSG.SAMPLE'
MANIFEST did not declare '.GIT/HOOKS/POST-COMMIT.SAMPLE'
MANIFEST did not declare '.GIT/HOOKS/POST-RECEIVE.SAMPLE'
MANIFEST did not declare '.GIT/HOOKS/POST-UPDATE.SAMPLE'
MANIFEST did not declare '.GIT/HOOKS/PRE-APPLYPATCH.SAMPLE'
MANIFEST did not declare '.GIT/HOOKS/PRE-COMMIT.SAMPLE'
MANIFEST did not declare '.GIT/HOOKS/PRE-REBASE.SAMPLE'
MANIFEST did not declare '.GIT/HOOKS/PREPARE-COMMIT-MSG.SAMPLE'
MANIFEST did not declare '.GIT/HOOKS/UPDATE.SAMPLE'
MANIFEST did not declare '.GIT/INDEX'
MANIFEST did not declare '.GIT/INFO/EXCLUDE'
MANIFEST did not declare '.GIT/LOGS/HEAD'
MANIFEST did not declare '.GIT/LOGS/REFS/HEADS/BLEAD'
MANIFEST did not declare '.GIT/LOGS/REFS/REMOTES/ORIGIN/BLEAD'
MANIFEST did not declare '.GIT/OBJECTS/PACK/PACK-6C18A822E0C6884297E23B22E3A67A86F675A21F.IDX'
MANIFEST did not declare '.GIT/OBJECTS/PACK/PACK-6C18A822E0C6884297E23B22E3A67A86F675A21F.PACK'
MANIFEST did not declare '.GIT/OBJECTS/PACK/PACK-B346214EA4AEA347A9DB58BF99C4063A67B8DD6C.IDX'
MANIFEST did not declare '.GIT/OBJECTS/PACK/PACK-B346214EA4AEA347A9DB58BF99C4063A67B8DD6C.PACK'
MANIFEST did not declare '.GIT/ORIG_HEAD'
MANIFEST did not declare '.GIT/PACKED-REFS'
MANIFEST did not declare '.GIT/REFS/HEADS/BLEAD'
MANIFEST did not declare '.GIT/REFS/REMOTES/ORIGIN/BLEAD'
MANIFEST did not declare '.GIT/REFS/REMOTES/ORIGIN/HEAD'
MANIFEST did not declare 'CPAN/.GITIGNORE'
MANIFEST did not declare 'CPAN/B-DEBUG/MAKEFILE.PL'
MANIFEST did not declare 'CPAN/CGI/MAKEFILE.PL'
MANIFEST did not declare 'CPAN/COMPRESS-RAW-BZIP2/.GITIGNORE'
MANIFEST did not declare 'CPAN/COMPRESS-RAW-ZLIB/.GITIGNORE'
MANIFEST did not declare 'CPAN/CPAN-META-REQUIREMENTS/MAKEFILE.PL'
MANIFEST did not declare 'CPAN/CPAN-META-YAML/MAKEFILE.PL'
MANIFEST did not declare 'CPAN/CPAN-META/MAKEFILE.PL'
MANIFEST did not declare 'CPAN/CPAN/MAKEFILE.PL'
MANIFEST did not declare 'CPAN/CPANPLUS-DIST-BUILD/MAKEFILE.PL'
MANIFEST did not declare 'CPAN/CPANPLUS/BLIB/SCRIPT/CPAN2DIST'
MANIFEST did not declare 'CPAN/CPANPLUS/BLIB/SCRIPT/CPAN2DIST.BAT'
MANIFEST did not declare 'CPAN/CPANPLUS/BLIB/SCRIPT/CPANP'
MANIFEST did not declare 'CPAN/CPANPLUS/BLIB/SCRIPT/CPANP-RUN-PERL'
MANIFEST did not declare 'CPAN/CPANPLUS/BLIB/SCRIPT/CPANP-RUN-PERL.BAT'
MANIFEST did not declare 'CPAN/CPANPLUS/BLIB/SCRIPT/CPANP.BAT'
MANIFEST did not declare 'CPAN/DB_FILE/.GITIGNORE'
MANIFEST did not declare 'CPAN/DEVEL-PPPORT/.GITIGNORE'
MANIFEST did not declare 'CPAN/DIGEST/MAKEFILE.PL'
MANIFEST did not declare 'CPAN/ENCODE/.GITIGNORE'
MANIFEST did not declare 'CPAN/EXTUTILS-CONSTANT/MAKEFILE.PL'
MANIFEST did not declare 'CPAN/EXTUTILS-MAKEMAKER/MAKEFILE.PL'
MANIFEST did not declare 'CPAN/FILE-FETCH/MAKEFILE.PL'
MANIFEST did not declare 'CPAN/FILE-PATH/MAKEFILE.PL'
MANIFEST did not declare 'CPAN/FILE-TEMP/MAKEFILE.PL'
MANIFEST did not declare 'CPAN/GETOPT-LONG/MAKEFILE.PL'
MANIFEST did not declare 'CPAN/HTTP-TINY/MAKEFILE.PL'
MANIFEST did not declare 'CPAN/IO-COMPRESS/BLIB/SCRIPT/ZIPDETAILS'
MANIFEST did not declare 'CPAN/IO-COMPRESS/BLIB/SCRIPT/ZIPDETAILS.BAT'
MANIFEST did not declare 'CPAN/IO-COMPRESS/TST3516X00004.TMP'
MANIFEST did not declare 'CPAN/IO-COMPRESS/TST3916X00004.TMP'
MANIFEST did not declare 'CPAN/IO-COMPRESS/TST5380X00004.TMP'
MANIFEST did not declare 'CPAN/IO-COMPRESS/TST6584X00004.TMP'
MANIFEST did not declare 'CPAN/IO-COMPRESS/TST6720X00004.TMP'
MANIFEST did not declare 'CPAN/IO-COMPRESS/TST6872X00004.TMP'
MANIFEST did not declare 'CPAN/IO-ZLIB/MAKEFILE.PL'
MANIFEST did not declare 'CPAN/IPC-SYSV/.GITIGNORE'
MANIFEST did not declare 'CPAN/MODULE-BUILD/.GITIGNORE'
MANIFEST did not declare 'CPAN/MODULE-PLUGGABLE/T/LIB/EDITORJUNK/PLUGIN/.GITIGNORE'
MANIFEST did not declare 'CPAN/MODULE-PLUGGABLE/T/LIB/ODDTEST/PLUGIN/.GITIGNORE'
MANIFEST did not declare 'CPAN/POD-LATEX/.GITIGNORE'
MANIFEST did not declare 'CPAN/POD-PARSER/.GITIGNORE'
MANIFEST did not declare 'CPAN/PODLATORS/.GITIGNORE'
MANIFEST did not declare 'CPAN/SOCKET/.GITIGNORE'
MANIFEST did not declare 'CPAN/SYS-SYSLOG/.GITIGNORE'
MANIFEST did not declare 'CPAN/UNICODE-COLLATE/.GITIGNORE'
MANIFEST did not declare 'CPAN/UNICODE-NORMALIZE/.GITIGNORE'
MANIFEST did not declare 'DIST/.GITIGNORE'
MANIFEST did not declare 'DIST/B-DEPARSE/MAKEFILE.PL'
MANIFEST did not declare 'DIST/B-LINT/MAKEFILE.PL'
MANIFEST did not declare 'DIST/DEVEL-SELFSTUBBER/MAKEFILE.PL'
MANIFEST did not declare 'DIST/DUMPVALUE/MAKEFILE.PL'
MANIFEST did not declare 'DIST/ENV/MAKEFILE.PL'
MANIFEST did not declare 'DIST/EXTUTILS-CBUILDER/COMPILET_DEF.OLD'
MANIFEST did not declare 'DIST/EXTUTILS-COMMAND/MAKEFILE.PL'
MANIFEST did not declare 'DIST/EXTUTILS-INSTALL/MAKEFILE.PL'
MANIFEST did not declare 'DIST/EXTUTILS-MANIFEST/MAKEFILE.PL'
MANIFEST did not declare 'DIST/EXTUTILS-PARSEXS/MAKEFILE.PL'
MANIFEST did not declare 'DIST/FILE-CHECKTREE/MAKEFILE.PL'
MANIFEST did not declare 'DIST/FILTER-SIMPLE/MAKEFILE.PL'
MANIFEST did not declare 'DIST/I18N-COLLATE/MAKEFILE.PL'
MANIFEST did not declare 'DIST/I18N-LANGTAGS/MAKEFILE.PL'
MANIFEST did not declare 'DIST/IO/.GITIGNORE'
MANIFEST did not declare 'DIST/LIB/.GITIGNORE'
MANIFEST did not declare 'DIST/SEARCH-DICT/DICT-1676'
MANIFEST did not declare 'DIST/SEARCH-DICT/DICT-5612'
MANIFEST did not declare 'DIST/XSLOADER/.GITIGNORE'
MANIFEST did not declare 'EXT/.GITIGNORE'
MANIFEST did not declare 'EXT/B/.GITIGNORE'
MANIFEST did not declare 'EXT/DYNALOADER/.GITIGNORE'
MANIFEST did not declare 'EXT/ERRNO/.GITIGNORE'
MANIFEST did not declare 'EXT/ERRNO/ARCH.TXT'
MANIFEST did not declare 'EXT/ERRNO/ERRNO.PM'
MANIFEST did not declare 'EXT/FCNTL/.GITIGNORE'
MANIFEST did not declare 'EXT/FILE-GLOB/.GITIGNORE'
MANIFEST did not declare 'EXT/FILECACHE/MAKEFILE.PL'
MANIFEST did not declare 'EXT/GDBM_FILE/.GITIGNORE'
MANIFEST did not declare 'EXT/I18N-LANGINFO/.GITIGNORE'
MANIFEST did not declare 'EXT/POD-FUNCTIONS/.GITIGNORE'
MANIFEST did not declare 'EXT/POD-HTML/.GITIGNORE'
MANIFEST did not declare 'EXT/POSIX/.GITIGNORE'
MANIFEST did not declare 'EXT/SDBM_FILE/SDBM/.GITIGNORE'
MANIFEST did not declare 'EXT/WIN32CORE/.GITIGNORE'
MANIFEST did not declare 'EXT/XS-APITEST/.GITIGNORE'
MANIFEST did not declare 'LIB/.GITIGNORE'
MANIFEST did not declare 'LIB/CARP.PM'
MANIFEST did not declare 'LIB/CARP/HEAVY.PM'
MANIFEST did not declare 'LIB/CGI.PM'
MANIFEST did not declare 'LIB/CPAN.PM'
MANIFEST did not declare 'LIB/CPANPLUS.PM'
MANIFEST did not declare 'LIB/DIGEST.PM'
MANIFEST did not declare 'LIB/DUMPVALUE.PM'
MANIFEST did not declare 'LIB/ENV.PM'
MANIFEST did not declare 'LIB/EXTUTILS/CBUILDER.PM'
MANIFEST did not declare 'LIB/EXTUTILS/COMMAND.PM'
MANIFEST did not declare 'LIB/EXTUTILS/CONSTANT.PM'
MANIFEST did not declare 'LIB/EXTUTILS/INSTALL.PM'
MANIFEST did not declare 'LIB/EXTUTILS/INSTALLED.PM'
MANIFEST did not declare 'LIB/EXTUTILS/LIBLIST.PM'
MANIFEST did not declare 'LIB/EXTUTILS/MAKEMAKER.PM'
MANIFEST did not declare 'LIB/EXTUTILS/MANIFEST.PM'
MANIFEST did not declare 'LIB/EXTUTILS/MANIFEST.SKIP'
MANIFEST did not declare 'LIB/EXTUTILS/MINIPERL.PM'
MANIFEST did not declare 'LIB/EXTUTILS/MKBOOTSTRAP.PM'
MANIFEST did not declare 'LIB/EXTUTILS/MKSYMLISTS.PM'
MANIFEST did not declare 'LIB/EXTUTILS/MM.PM'
MANIFEST did not declare 'LIB/EXTUTILS/MM_AIX.PM'
MANIFEST did not declare 'LIB/EXTUTILS/MM_ANY.PM'
MANIFEST did not declare 'LIB/EXTUTILS/MM_BEOS.PM'
MANIFEST did not declare 'LIB/EXTUTILS/MM_CYGWIN.PM'
MANIFEST did not declare 'LIB/EXTUTILS/MM_DARWIN.PM'
MANIFEST did not declare 'LIB/EXTUTILS/MM_DOS.PM'
MANIFEST did not declare 'LIB/EXTUTILS/MM_MACOS.PM'
MANIFEST did not declare 'LIB/EXTUTILS/MM_NW5.PM'
MANIFEST did not declare 'LIB/EXTUTILS/MM_OS2.PM'
MANIFEST did not declare 'LIB/EXTUTILS/MM_QNX.PM'
MANIFEST did not declare 'LIB/EXTUTILS/MM_UNIX.PM'
MANIFEST did not declare 'LIB/EXTUTILS/MM_UWIN.PM'
MANIFEST did not declare 'LIB/EXTUTILS/MM_VMS.PM'
MANIFEST did not declare 'LIB/EXTUTILS/MM_VOS.PM'
MANIFEST did not declare 'LIB/EXTUTILS/MM_WIN32.PM'
MANIFEST did not declare 'LIB/EXTUTILS/MM_WIN95.PM'
MANIFEST did not declare 'LIB/EXTUTILS/MY.PM'
MANIFEST did not declare 'LIB/EXTUTILS/PACKLIST.PM'
MANIFEST did not declare 'LIB/EXTUTILS/PARSEXS.PM'
MANIFEST did not declare 'LIB/EXTUTILS/PARSEXS.POD'
MANIFEST did not declare 'LIB/EXTUTILS/PARSEXS/CONSTANTS.PM'
MANIFEST did not declare 'LIB/EXTUTILS/PARSEXS/COUNTLINES.PM'
MANIFEST did not declare 'LIB/EXTUTILS/PARSEXS/UTILITIES.PM'
MANIFEST did not declare 'LIB/EXTUTILS/TESTLIB.PM'
MANIFEST did not declare 'LIB/EXTUTILS/TYPEMAPS.PM'
MANIFEST did not declare 'LIB/EXTUTILS/TYPEMAPS/CMD.PM'
MANIFEST did not declare 'LIB/EXTUTILS/TYPEMAPS/INPUTMAP.PM'
MANIFEST did not declare 'LIB/EXTUTILS/TYPEMAPS/OUTPUTMAP.PM'
MANIFEST did not declare 'LIB/EXTUTILS/TYPEMAPS/TYPE.PM'
MANIFEST did not declare 'LIB/EXTUTILS/XSUBPP'
MANIFEST did not declare 'LIB/FILE/CHECKTREE.PM'
MANIFEST did not declare 'LIB/FILE/FETCH.PM'
MANIFEST did not declare 'LIB/FILE/GLOBMAPPER.PM'
MANIFEST did not declare 'LIB/FILE/PATH.PM'
MANIFEST did not declare 'LIB/FILE/TEMP.PM'
MANIFEST did not declare 'LIB/FILECACHE.PM'
MANIFEST did not declare 'LIB/GETOPT/LONG.PM'
MANIFEST did not declare 'LIB/HTTP/TINY.PM'
MANIFEST did not declare 'LIB/I18N/COLLATE.PM'
MANIFEST did not declare 'LIB/I18N/LANGTAGS.PM'
MANIFEST did not declare 'LIB/PERLXS.POD'
MANIFEST did not declare 'LIB/PERLXSTUT.POD'
MANIFEST did not declare 'LIB/PERLXSTYPEMAP.POD'
MANIFEST did not declare 'MKTEST.JSN'
MANIFEST did not declare 'PATCHLEVEL.BAK'
MANIFEST did not declare 'POD/.GITIGNORE'
MANIFEST did not declare 'POLICY.SH'
MANIFEST did not declare 'T/TMP4344B.DIR'
MANIFEST did not declare 'T/TMP4344B.PAG'
MANIFEST did not declare 'T/TMP5024B.DIR'
MANIFEST did not declare 'T/TMP5024B.PAG'
MANIFEST did not declare 'UTILS/.GITIGNORE'
MANIFEST did not declare 'WIN32/.GITIGNORE'
MANIFEST did not declare 'WIN32/SMOKE.MK'
MANIFEST did not declare 'X2P/.GITIGNORE'

Passed Todo tests: (common-args) -DCCTYPE=MSVC100
[default] -Duseithreads -Duselargefiles
[default] -DDEBUGGING -Duseithreads -Duselargefiles
./cpan/CGI/t/tmpdir.t......................................PASSED
3-9

Compiler messages(MSWin32):
.\mg.c(676) : warning C4646: function declared with __declspec(noreturn) has non-void return type
.\mg.c(681) : warning C4645: function declared with __declspec(noreturn) has a return statement
op.c(11013) : warning C4028: formal parameter 1 different from declaration
.\pp_hot.c(2688) : warning C4244: 'initializing' : conversion from 'I32' to 'U8', possible loss of data
.\pp_sort.c(1668) : warning C4244: 'initializing' : conversion from 'I32' to 'U8', possible loss of data
.\regcomp.c(10746) : warning C4244: '=' : conversion from 'UV' to 'char', possible loss of data
.\regcomp.c(12149) : warning C4244: '=' : conversion from 'IV' to 'U8', possible loss of data
.\regexec.c(4383) : warning C4244: 'initializing' : conversion from 'I32' to 'U8', possible loss of data
.\regexec.c(4386) : warning C4244: 'initializing' : conversion from 'I32' to 'U8', possible loss of data
op.c(11013) : warning C4028: formal parameter 2 different from declaration
IO.xs(493) : warning C4101: 'ret' : unreferenced local variable
ListUtil.xs(249) : warning C4244: 'initializing' : conversion from 'I32' to 'U8', possible loss of data
ListUtil.xs(297) : warning C4244: 'initializing' : conversion from 'I32' to 'U8', possible loss of data
Base64.xs(394) : warning C4146: unary minus operator applied to unsigned type, result still unsigned
Base64.xs(396) : warning C4146: unary minus operator applied to unsigned type, result still unsigned
POSIX.xs(707) : warning C4101: 'charstring' : unreferenced local variable
Storable.xs(4902) : warning C4101: 'mg' : unreferenced local variable
Storable.xs(4934) : warning C4101: 'mg' : unreferenced local variable
Piece.xs(950) : warning C4101: 'ret' : unreferenced local variable
APItest.xs(3069) : warning C4244: 'initializing' : conversion from 'I32' to 'U8', possible loss of data
APItest.xs(3417) : warning C4101: 'tmp' : unreferenced local variable
re_exec.c(4383) : warning C4244: 'initializing' : conversion from 'I32' to 'U8', possible loss of data
re_exec.c(4386) : warning C4244: 'initializing' : conversion from 'I32' to 'U8', possible loss of data
re_comp.c(10746) : warning C4244: '=' : conversion from 'UV' to 'char', possible loss of data
re_comp.c(12149) : warning C4244: '=' : conversion from 'IV' to 'U8', possible loss of data

--
Report by Test::Smoke v1.53 build 1374 running on perl 5.15.7
(Reporter v0.050 / Smoker v0.045)

Perl porters RSS feed   Index | Next | Previous | View Threaded
 
 


Interested in having your list archived? Contact Gossamer Threads
 
  Web Applications & Managed Hosting Powered by Gossamer Threads Inc.