Login | Register For Free | Help
Search for: (Advanced)

Mailing List Archive: Perl: porters

Smoke [blead] v5.17.2-207-g4ffbb0c FAIL(F) MSWin32 Win2000 SP4 (x86/1 cpu)

 

 

Perl porters RSS feed   Index | Next | Previous | View Threaded


perl at greerga

Aug 4, 2012, 2:21 AM

Post #1 of 1 (82 views)
Permalink
Smoke [blead] v5.17.2-207-g4ffbb0c FAIL(F) MSWin32 Win2000 SP4 (x86/1 cpu)

Smoke logs available at http://m-l.org/~perl/smoke/perl/

Note: Due to a quirk of the virtual machine, build failures are generally
because of timing issues on the VM rather than Perl problems, unless all
of the grid says "M".

Automated smoke report for 5.17.3 patch 4ffbb0c46e27652ffde1eadeda1809a0338fa182 v5.17.2-207-g4ffbb0c
perl-win2k: Intel(R) Core(TM) i7 CPU 920 @ 2.67GHz(~2661 MHz) (x86/1 cpu)
on MSWin32 - Win2000 SP4
using cl version 14.00.50727.762
smoketime 2 hours 23 minutes (average 35 minutes 48 seconds)

Summary: FAIL(F)

O = OK F = Failure(s), extended report at the bottom
X = Failure(s) under TEST but not under harness
? = still running or test results not (yet) available
Build failures during: - = unknown or N/A
c = Configure, m = make, M = make (after miniperl), t = make test-prep

v5.17.2-207-g4ffbb0c Configuration (common) none
----------- ---------------------------------------------------------
F F
F F -Duseithreads
| +--------- -DDEBUGGING
+----------- no debugging


Locally applied patches:
uncommitted-changes
SMOKE4ffbb0c46e27652ffde1eadeda1809a0338fa182

Failures: (common-args) none
[default]
../t/op/magic.t.............................................FAILED
150-152, 154, 157, 161, 163
../t/op/sselect.t...........................................FAILED
10
../cpan/Memoize/t/expmod_t.t................................FAILED
7

[default] -DDEBUGGING
../t/op/magic.t.............................................FAILED
150-152, 154, 157, 161, 163

[default] -Duseithreads
../t/op/alarm.t.............................................FAILED
2, 4
../t/op/magic.t.............................................FAILED
150-152, 154, 157, 161, 163
../cpan/Memoize/t/expmod_t.t................................FAILED
7, 10

[default] -DDEBUGGING -Duseithreads
../t/op/magic.t.............................................FAILED
150-152, 154, 157, 161, 163
../cpan/IPC-Cmd/t/01_IPC-Cmd.t..............................FAILED
42
Non-zero exit status: 1

Passed Todo tests: (common-args) none
[default]
[default] -DDEBUGGING
[default] -Duseithreads
[default] -DDEBUGGING -Duseithreads
../cpan/CGI/t/tmpdir.t......................................PASSED
3-9

Compiler messages(MSWin32):
..\mg.c(676) : warning C4646: function declared with __declspec(noreturn) has non-void return type
..\mg.c(681) : warning C4645: function declared with __declspec(noreturn) has a return statement
op.c(6871) : warning C4244: 'initializing' : conversion from 'U32' to 'const char', possible loss of data
op.c(10992) : warning C4028: formal parameter 1 different from declaration
..\pp.c(5837) : warning C4244: 'function' : conversion from 'U32' to 'const char', possible loss of data
..\pp_hot.c(2688) : warning C4244: 'initializing' : conversion from 'I32' to 'U8', possible loss of data
..\pp_sort.c(1668) : warning C4244: 'initializing' : conversion from 'I32' to 'U8', possible loss of data
..\regcomp.c(10746) : warning C4244: '=' : conversion from 'UV' to 'char', possible loss of data
..\regcomp.c(12149) : warning C4244: '=' : conversion from 'IV' to 'U8', possible loss of data
..\regexec.c(4383) : warning C4244: 'initializing' : conversion from 'I32' to 'U8', possible loss of data
..\regexec.c(4386) : warning C4244: 'initializing' : conversion from 'I32' to 'U8', possible loss of data
..\toke.c(760) : warning C4244: '=' : conversion from 'U32' to 'U8', possible loss of data
IO.xs(493) : warning C4101: 'ret' : unreferenced local variable
ListUtil.xs(249) : warning C4244: 'initializing' : conversion from 'I32' to 'U8', possible loss of data
ListUtil.xs(297) : warning C4244: 'initializing' : conversion from 'I32' to 'U8', possible loss of data
Base64.xs(394) : warning C4146: unary minus operator applied to unsigned type, result still unsigned
Base64.xs(396) : warning C4146: unary minus operator applied to unsigned type, result still unsigned
POSIX.xs(707) : warning C4101: 'charstring' : unreferenced local variable
scalar.xs(175) : warning C4018: '>' : signed/unsigned mismatch
Storable.xs(4902) : warning C4101: 'mg' : unreferenced local variable
Storable.xs(4934) : warning C4101: 'mg' : unreferenced local variable
Piece.xs(950) : warning C4101: 'ret' : unreferenced local variable
APItest.xs(3069) : warning C4244: 'initializing' : conversion from 'I32' to 'U8', possible loss of data
APItest.xs(3417) : warning C4101: 'tmp' : unreferenced local variable
re_exec.c(4383) : warning C4244: 'initializing' : conversion from 'I32' to 'U8', possible loss of data
re_exec.c(4386) : warning C4244: 'initializing' : conversion from 'I32' to 'U8', possible loss of data
re_comp.c(10746) : warning C4244: '=' : conversion from 'UV' to 'char', possible loss of data
re_comp.c(12149) : warning C4244: '=' : conversion from 'IV' to 'U8', possible loss of data
op.c(10992) : warning C4028: formal parameter 2 different from declaration

--
Report by Test::Smoke v1.42 build 1267 running on perl 5.10.0
(Reporter v0.035 / Smoker v0.045)

Perl porters RSS feed   Index | Next | Previous | View Threaded
 
 


Interested in having your list archived? Contact Gossamer Threads
 
  Web Applications & Managed Hosting Powered by Gossamer Threads Inc.