Login | Register For Free | Help
Search for: (Advanced)

Mailing List Archive: Perl: porters

Smoke [blead] v5.15.9-132-gfc4b5f7 FAIL(F) MSWin32 Win2000 SP4 (x86/1 cpu)

 

 

Perl porters RSS feed   Index | Next | Previous | View Threaded


perl at greerga

Apr 12, 2012, 12:21 PM

Post #1 of 1 (65 views)
Permalink
Smoke [blead] v5.15.9-132-gfc4b5f7 FAIL(F) MSWin32 Win2000 SP4 (x86/1 cpu)

Smoke logs available at http://m-l.org/~perl/smoke/perl/

NOTE! This smoke was executed on a VirtualBox VM which has a propensity for
having clock issues. If in the matrix below you see only a single "M" result
or any "t" result then it is likely from the clock rather than real build
failure. You can verify that by looking for "Makefile out-of-date" in the log.

Automated smoke report for 5.15.9 patch fc4b5f72837b3df426905782485aee7b794cb692 v5.15.9-132-gfc4b5f7
perl-win2k: Intel(R) Core(TM) i7 CPU 920 @ 2.67GHz(~2657 MHz) (x86/1 cpu)
on MSWin32 - Win2000 SP4
using cl version 14.00.50727.762
smoketime 3 hours 46 minutes (average 56 minutes 43 seconds)

Summary: FAIL(F)

O = OK F = Failure(s), extended report at the bottom
X = Failure(s) under TEST but not under harness
? = still running or test results not (yet) available
Build failures during: - = unknown or N/A
c = Configure, m = make, M = make (after miniperl), t = make test-prep

v5.15.9-132-gfc4b5f7 Configuration (common) none
----------- ---------------------------------------------------------
F F
F F -Duseithreads
| +--------- -DDEBUGGING
+----------- no debugging


Locally applied patches:
uncommitted-changes
SMOKEfc4b5f72837b3df426905782485aee7b794cb692

Failures: (common-args) none
[default]
[default] -DDEBUGGING
[default] -Duseithreads
../ext/Pod-Html/t/feature.t.................................FAILED
1
Non-zero exit status: 1
../ext/Pod-Html/t/htmldir3.t................................FAILED
1
Non-zero exit status: 1
../ext/Pod-Html/t/htmldir4.t................................FAILED
2
Non-zero exit status: 1
../ext/Pod-Html/t/htmldir5.t................................FAILED
1
Non-zero exit status: 1

[default] -DDEBUGGING -Duseithreads
../dist/threads/t/free2.t...................................FAILED
Non-zero exit status: 1
Bad plan. You planned 78 tests but ran 70.
../ext/Pod-Html/t/feature.t.................................FAILED
1
Non-zero exit status: 1
../ext/Pod-Html/t/htmldir3.t................................FAILED
1
Non-zero exit status: 1
../ext/Pod-Html/t/htmldir4.t................................FAILED
2
Non-zero exit status: 1
../ext/Pod-Html/t/htmldir5.t................................FAILED
1
Non-zero exit status: 1

Passed Todo tests: (common-args) none
[default]
[default] -DDEBUGGING
[default] -Duseithreads
[default] -DDEBUGGING -Duseithreads
../cpan/CGI/t/tmpdir.t......................................PASSED
3-9

Compiler messages(MSWin32):
op.c(6522) : warning C4244: 'initializing' : conversion from 'U32' to 'const char', possible loss of data
op.c(10619) : warning C4028: formal parameter 1 different from declaration
..\pp.c(5978) : warning C4244: 'function' : conversion from 'U32' to 'const char', possible loss of data
..\pp_hot.c(2685) : warning C4244: 'initializing' : conversion from 'I32' to 'U8', possible loss of data
..\pp_sort.c(1668) : warning C4244: 'initializing' : conversion from 'I32' to 'U8', possible loss of data
..\toke.c(765) : warning C4244: '=' : conversion from 'U32' to 'U8', possible loss of data
IO.xs(488) : warning C4101: 'ret' : unreferenced local variable
ListUtil.xs(297) : warning C4244: 'initializing' : conversion from 'I32' to 'U8', possible loss of data
ListUtil.xs(335) : warning C4244: 'initializing' : conversion from 'I32' to 'U8', possible loss of data
Base64.xs(394) : warning C4146: unary minus operator applied to unsigned type, result still unsigned
Base64.xs(396) : warning C4146: unary minus operator applied to unsigned type, result still unsigned
POSIX.xs(705) : warning C4101: 'charstring' : unreferenced local variable
scalar.xs(175) : warning C4018: '>' : signed/unsigned mismatch
Piece.xs(950) : warning C4101: 'ret' : unreferenced local variable
APItest.xs(3011) : warning C4244: 'initializing' : conversion from 'I32' to 'U8', possible loss of data
APItest.xs(3323) : warning C4101: 'tmp' : unreferenced local variable
op.c(10619) : warning C4028: formal parameter 2 different from declaration

--
Report by Test::Smoke v1.42 build 1267 running on perl 5.10.0
(Reporter v0.035 / Smoker v0.045)

Perl porters RSS feed   Index | Next | Previous | View Threaded
 
 


Interested in having your list archived? Contact Gossamer Threads
 
  Web Applications & Managed Hosting Powered by Gossamer Threads Inc.