Login | Register For Free | Help
Search for: (Advanced)

Mailing List Archive: Perl: porters

Smoke [blead] v5.15.7-427-geff4920 FAIL(F) linux 3.0.0-15-generic [debian] (x86_64/8 cpu)

 

 

Perl porters RSS feed   Index | Next | Previous | View Threaded


perl at greerga

Feb 17, 2012, 10:20 AM

Post #1 of 2 (130 views)
Permalink
Smoke [blead] v5.15.7-427-geff4920 FAIL(F) linux 3.0.0-15-generic [debian] (x86_64/8 cpu)

Smoke logs available at http://m-l.org/~perl/smoke/perl/

Automated smoke report for 5.15.7 patch eff4920e4fd674f651f7f7bfcd8edf5f14259634 v5.15.7-427-geff4920
zwei: Intel(R) Core(TM) i7 CPU 920 @ 2.67GHz (GenuineIntel 2668MHz) (x86_64/8 cpu)
on linux - 3.0.0-15-generic [debian]
using clang version 4.2.1 Compatible Clang Compiler
smoketime 1 hour 16 minutes (average 19 minutes 7 seconds)

Summary: FAIL(F)

O = OK F = Failure(s), extended report at the bottom
X = Failure(s) under TEST but not under harness
? = still running or test results not (yet) available
Build failures during: - = unknown or N/A
c = Configure, m = make, M = make (after miniperl), t = make test-prep

v5.15.7-427-geff4920 Configuration (common) -A -Dcc=clang append:ccflags=" -fcatch-undefined-behavior "
----------- ---------------------------------------------------------
O O O F
O O O O -Duseithreads
| +--------- -DDEBUGGING
+----------- no debugging


Locally applied patches:
uncommitted-changes
SMOKEeff4920e4fd674f651f7f7bfcd8edf5f14259634

Testsuite was run only with 'harness'

Failures: (common-args) -A -Dcc=clang append:ccflags=" -fcatch-undefined-behavior "
[minitest] -DDEBUGGING
t/re/regexp_qr_embed ........... FAILED--non-zero wait status: 5632

Passed Todo tests: (common-args) -A -Dcc=clang append:ccflags=" -fcatch-undefined-behavior "
[default]
[default] -DDEBUGGING
[default] -Duseithreads
[default] -DDEBUGGING -Duseithreads
../cpan/CGI/t/tmpdir.t......................................PASSED
3-9

Compiler messages(gcc):
try.c:22:14: error: use of undeclared identifier 'KERN_PROC'; did you mean 'KERN_PROF'?
try.c:23:14: error: use of undeclared identifier 'KERN_PROC_PATHNAME'
try.c:5785:17: warning: extra tokens at end of #ifdef directive [-Wextra-tokens]
try.c:5788:18: warning: extra tokens at end of #ifdef directive [-Wextra-tokens]
try.c:5791:19: warning: extra tokens at end of #ifdef directive [-Wextra-tokens]
try.c:5794:19: warning: extra tokens at end of #ifdef directive [-Wextra-tokens]
try.c:5821:17: warning: extra tokens at end of #ifdef directive [-Wextra-tokens]
try.c:5824:18: warning: extra tokens at end of #ifdef directive [-Wextra-tokens]
try.c:5827:19: warning: extra tokens at end of #ifdef directive [-Wextra-tokens]
try.c:5830:19: warning: extra tokens at end of #ifdef directive [-Wextra-tokens]
try.c:5857:17: warning: extra tokens at end of #ifdef directive [-Wextra-tokens]
try.c:5860:18: warning: extra tokens at end of #ifdef directive [-Wextra-tokens]
try.c:5863:19: warning: extra tokens at end of #ifdef directive [-Wextra-tokens]
try.c:5866:19: warning: extra tokens at end of #ifdef directive [-Wextra-tokens]
try.c:5893:16: warning: extra tokens at end of #ifdef directive [-Wextra-tokens]
try.c:5896:17: warning: extra tokens at end of #ifdef directive [-Wextra-tokens]
try.c:5899:18: warning: extra tokens at end of #ifdef directive [-Wextra-tokens]
try.c:5902:18: warning: extra tokens at end of #ifdef directive [-Wextra-tokens]
try.c:5929:18: warning: extra tokens at end of #ifdef directive [-Wextra-tokens]
try.c:5932:19: warning: extra tokens at end of #ifdef directive [-Wextra-tokens]
try.c:5935:20: warning: extra tokens at end of #ifdef directive [-Wextra-tokens]
try.c:5938:20: warning: extra tokens at end of #ifdef directive [-Wextra-tokens]
try.c:6817:18: warning: extra tokens at end of #ifdef directive [-Wextra-tokens]
try.c:6820:19: warning: extra tokens at end of #ifdef directive [-Wextra-tokens]
try.c:6823:20: warning: extra tokens at end of #ifdef directive [-Wextra-tokens]
try.c:6826:20: warning: extra tokens at end of #ifdef directive [-Wextra-tokens]
try.c:6853:18: warning: extra tokens at end of #ifdef directive [-Wextra-tokens]
try.c:6856:19: warning: extra tokens at end of #ifdef directive [-Wextra-tokens]
try.c:6859:20: warning: extra tokens at end of #ifdef directive [-Wextra-tokens]
try.c:6862:20: warning: extra tokens at end of #ifdef directive [-Wextra-tokens]
try.c:6889:18: warning: extra tokens at end of #ifdef directive [-Wextra-tokens]
try.c:6892:19: warning: extra tokens at end of #ifdef directive [-Wextra-tokens]
try.c:6895:20: warning: extra tokens at end of #ifdef directive [-Wextra-tokens]
try.c:6898:20: warning: extra tokens at end of #ifdef directive [-Wextra-tokens]
try.c:6925:17: warning: extra tokens at end of #ifdef directive [-Wextra-tokens]
try.c:6928:18: warning: extra tokens at end of #ifdef directive [-Wextra-tokens]
try.c:6931:19: warning: extra tokens at end of #ifdef directive [-Wextra-tokens]
try.c:6934:19: warning: extra tokens at end of #ifdef directive [-Wextra-tokens]
try.c:6961:19: warning: extra tokens at end of #ifdef directive [-Wextra-tokens]
try.c:6964:20: warning: extra tokens at end of #ifdef directive [-Wextra-tokens]
try.c:6967:21: warning: extra tokens at end of #ifdef directive [-Wextra-tokens]
try.c:6970:21: warning: extra tokens at end of #ifdef directive [-Wextra-tokens]
scope.c:691:68: warning: conversion specifies type 'long' but the argument has type 'I32' (aka 'int') [-Wformat]
scope.c:691:72: warning: conversion specifies type 'long' but the argument has type 'I32' (aka 'int') [-Wformat]
perl.c:365:6: warning: expression result unused [-Wunused-value]
pp_hot.c:144:3: warning: expression result unused [-Wunused-value]
sv.c:502:5: warning: expression result unused [-Wunused-value]
sv.c:544:5: warning: expression result unused [-Wunused-value]
perlio.c:5189:21: warning: comparison of integers of different signs: 'size_t' (aka 'unsigned long') and 'int' [-Wsign-compare]
toke.c:2203:3: warning: expression result unused [-Wunused-value]
mro.c:619:21: warning: expression result unused [-Wunused-value]
toke.c:3860:5: warning: expression result unused [-Wunused-value]
mro.c:665:2: warning: expression result unused [-Wunused-value]
util.c:579:5: warning: expression result unused [-Wunused-value]
pp_ctl.c:284:2: warning: expression result unused [-Wunused-value]
pp_hot.c:1209:5: warning: In file included from pp_ctl.c:35:
pp_ctl.c:404:2: warning: expression result unused [-Wunused-value]
pp_ctl.c:416:8: warning: expression result unused [-Wunused-value]
pp_ctl.c:975:3: warning: expression result unused [-Wunused-value]
pp_sys.c:443:25: warning: expression result unused [-Wunused-value]
pp_sys.c:480:25: warning: expression result unused [-Wunused-value]
util.c:2723:5: warning: expression result unused [-Wunused-value]
util.c:2880:5: warning: expression result unused [-Wunused-value]
sv.c:2757:3: warning: expression result unused [-Wunused-value]
pp_hot.c:1634:2: warning: expression result unused [-Wunused-value]
pp_sys.c:1735:2: warning: expression result unused [-Wunused-value]
doop.c:696:3: warning: expression result unused [-Wunused-value]
^pp_hot.c:2335:6: warning: expression result unused [-Wunused-value]
sv.c:4088:6: warning: expression result unused [-Wunused-value]
sv.c:4090:6: warning: expression result unused [-Wunused-value]
sv.c:4496:5: warning: expression result unused [-Wunused-value]
sv.c:4547:5: warning: expression result unused [-Wunused-value]
sv.c:4605:6: warning: expression result unused [-Wunused-value]
sv.c:4652:5: warning: expression result unused [-Wunused-value]
sv.c:5211:5: warning: expression result unused [-Wunused-value]
doio.c:638:17: warning: expression result unused [-Wunused-value]
doio.c:642:17: warning: expression result unused [-Wunused-value]
sv.c:7601:5: warning: expression result unused [-Wunused-value]
pp_ctl.c:2245:3: warning: expression result unused [-Wunused-value]
pp_ctl.c:2260:6: warning: expression result unused [-Wunused-value]
sv.c:9100:6: warning: expression result unused [-Wunused-value]
toke.c:7652:7: warning: expression result unused [-Wunused-value]
sv.c:9496:5: warning: expression result unused [-Wunused-value]
utf8.c:1469:20: warning: implicit conversion from 'int' to 'U8' (aka 'unsigned char') changes value from 65533 to 253 [-Wconstant-conversion]
pp.c:3362:5: warning: expression result unused [-Wunused-value]
pp.c:3539:22: warning: implicit conversion from 'int' to 'U8' (aka 'unsigned char') changes value from 65533 to 253 [-Wconstant-conversion]
pp.c:3607:2: warning: expression result unused [-Wunused-value]
pp.c:3750:2: warning: expression result unused [-Wunused-value]
pp.c:3853:12: warning: implicit conversion from 'int' to 'U8' (aka 'unsigned char') changes value from 65533 to 253 [-Wconstant-conversion]
pp.c:3987:2: warning: expression result unused [-Wunused-value]
pp.c:4061:12: warning: implicit conversion from 'int' to 'U8' (aka 'unsigned char') changes value from 65533 to 253 [-Wconstant-conversion]
pp.c:4086:2: warning: expression result unused [-Wunused-value]
pp.c:4289:26: warning: implicit conversion from 'int' to 'U8' (aka 'unsigned char') changes value from 65533 to 253 [-Wconstant-conversion]
pp.c:4186:5: warning: expression result unused [-Wunused-value]
op.c:8021:5: warning: expression result unused [-Wunused-value]
utf8.c:2629:6: warning: expression result unused [-Wunused-value]
regexec.c:4227:19: warning: expression result unused [-Wunused-value]
doio.c:2287:2: warning: expression result unused [-Wunused-value]
regexec.c:5496:9: warning: expression result unused [-Wunused-value]
op.c:9405:9: warning: array index of '2' indexes past the end of an array (that contains 1 elements) [-Warray-bounds]
op.c:10066:4: warning: expression result unused [-Wunused-value]
pp_ctl.c:4490:5: warning: expression result unused [-Wunused-value]
pp_ctl.c:5478:5: warning: expression result unused [-Wunused-value]
regcomp.c:12643:11: warning: expression result unused [-Wunused-value]
Util.xs:55:9: warning: expression result unused [-Wunused-value]
Call.xs:62:58: warning: conversion specifies type 'int' but the argument has type 'STRLEN' (aka 'unsigned long') [-Wformat]
Call.xs:62:78: warning: conversion specifies type 'int' but the argument has type 'STRLEN' (aka 'unsigned long') [-Wformat]
Call.xs:99:53: warning: conversion specifies type 'int' but the argument has type 'STRLEN' (aka 'unsigned long') [-Wformat]
Call.xs:155:46: warning: conversion specifies type 'int' but the argument has type 'STRLEN' (aka 'unsigned long') [-Wformat]
Call.xs:174:57: warning: conversion specifies type 'int' but the argument has type 'STRLEN' (aka 'unsigned long') [-Wformat]
./const-c.inc:47:2: warning: expression result unused [-Wunused-value]
./const-c.inc:81:5: warning: expression result unused [-Wunused-value]
Glob.xs:100:2: warning: expression result unused [-Wunused-value]
Glob.xs:108:6: warning: expression result unused [-Wunused-value]
mro.xs:120:7: warning: expression result unused [-Wunused-value]
Opcode.xs:268:9: warning: expression result unused [-Wunused-value]
./const-c.inc:38:2: warning: expression result unused [-Wunused-value]
./const-c.inc:73:5: warning: expression result unused [-Wunused-value]
Typemap.xs:179:46: warning: conversion specifies type 'unsigned int' but the argument has type 'UV' (aka 'unsigned long') [-Wformat]
Typemap.xs:265:3: warning: expression result unused [-Wunused-value]
./const-c.inc:72:5: warning: expression result unused [-Wunused-value]
Typemap.xs:287:3: warning: expression result unused [-Wunused-value]
Typemap.xs:310:3: warning: expression result unused [-Wunused-value]
Typemap.xs:333:3: warning: expression result unused [-Wunused-value]
Typemap.xs:356:3: warning: expression result unused [-Wunused-value]
Zlib.xs:619:5: warning: expression result unused [-Wunused-value]
Storable.xs:1793:3: warning: expression result unused [-Wunused-value]
re_exec.c:4227:19: warning: expression result unused [-Wunused-value]
Bzip2.xs:326:5: warning: expression result unused [-Wunused-value]
re_exec.c:5496:9: warning: expression result unused [-Wunused-value]
scalar.xs:48:5: warning: expression result unused [-Wunused-value]
Socket.xs:252:2: warning: expression result unused [-Wunused-value]
Socket.xs:493:44: warning: conversion specifies type 'int' but the argument has type 'STRLEN' (aka 'unsigned long') [-Wformat]
Socket.xs:493:58: warning: conversion specifies type 'int' but the argument has type 'unsigned long' [-Wformat]
Socket.xs:514:44: warning: conversion specifies type 'int' but the argument has type 'STRLEN' (aka 'unsigned long') [-Wformat]
Socket.xs:514:67: warning: conversion specifies type 'int' but the argument has type 'unsigned long' [-Wformat]
Socket.xs:641:44: warning: conversion specifies type 'int' but the argument has type 'STRLEN' (aka 'unsigned long') [-Wformat]
Socket.xs:641:58: warning: conversion specifies type 'int' but the argument has type 'unsigned long' [-Wformat]
Socket.xs:665:47: warning: conversion specifies type 'int' but the argument has type 'STRLEN' (aka 'unsigned long') [-Wformat]
Socket.xs:665:61: warning: conversion specifies type 'int' but the argument has type 'unsigned long' [-Wformat]
Socket.xs:697:40: warning: conversion specifies type 'int' but the argument has type 'STRLEN' (aka 'unsigned long') [-Wformat]
Socket.xs:697:54: warning: conversion specifies type 'int' but the argument has type 'unsigned long' [-Wformat]
Socket.xs:730:44: warning: conversion specifies type 'int' but the argument has type 'STRLEN' (aka 'unsigned long') [-Wformat]
Socket.xs:730:58: warning: conversion specifies type 'int' but the argument has type 'unsigned long' [-Wformat]
Socket.xs:840:40: warning: conversion specifies type 'int' but the argument has type 'STRLEN' (aka 'unsigned long') [-Wformat]
Socket.xs:840:54: warning: conversion specifies type 'int' but the argument has type 'unsigned long' [-Wformat]
Socket.xs:861:44: warning: conversion specifies type 'int' but the argument has type 'STRLEN' (aka 'unsigned long') [-Wformat]
Socket.xs:861:58: warning: conversion specifies type 'int' but the argument has type 'unsigned long' [-Wformat]
Storable.xs:4035:2: warning: null passed to a callee which requires a non-null argument [-Wnonnull]
Storable.xs:4468:2: warning: expression result unused [-Wunused-value]
Storable.xs:5353:3: warning: expression result unused [-Wunused-value]
Storable.xs:5400:2: warning: expression result unused [-Wunused-value]
Storable.xs:5440:2: warning: null passed to a callee which requires a non-null argument [-Wnonnull]
Storable.xs:5503:2: warning: null passed to a callee which requires a non-null argument [-Wnonnull]
Storable.xs:5814:4: warning: expression result unused [-Wunused-value]
Storable.xs:5855:3: warning: expression result unused [-Wunused-value]
Storable.xs:6014:5: warning: expression result unused [-Wunused-value]
APItest.xs:112:5: warning: expression result unused [-Wunused-value]
APItest.xs:1471:2: warning: expression result unused [-Wunused-value]
APItest.xs:2175:2: warning: expression result unused [-Wunused-value]
Collate.xs:607:2: warning: expression result unused [-Wunused-value]
Collate.xs:597:2: warning: expression result unused [-Wunused-value]
Unicode.xs:176:6: warning: expression result unused [-Wunused-value]
Unicode.xs:334:6: warning: expression result unused [-Wunused-value]
ExtTest.xs:44:2: warning: expression result unused [-Wunused-value]
ExtTest.xs:78:5: warning: expression result unused [-Wunused-value]
doop.c:691:5: warning: expression result unused [-Wunused-value]
pp_hot.c:1209:5: warning: expression result unused [-Wunused-value]
sv.c:3661:6: warning: expression result unused [-Wunused-value]
pp_hot.c:2335:6: warning: expression result unused [-Wunused-value]
./handy.h:799:pp_hot.c:1209:5: warning: expression result unused [-Wunused-value]
regexec.c:2630:8: warning: expression result unused [-Wunused-value]
re_exec.c:2630:8: warning: expression result unused [-Wunused-value]
--
Report by Test::Smoke v1.44 build 1285 running on perl 5.12.4
(Reporter v0.035 / Smoker v0.045)


perl at greerga

Feb 18, 2012, 4:22 AM

Post #2 of 2 (123 views)
Permalink
Smoke [blead] v5.15.7-427-geff4920 FAIL(F) linux 3.0.0-15-generic [debian] (x86_64/8 cpu) [In reply to]

Smoke logs available at http://m-l.org/~perl/smoke/perl/

Automated smoke report for 5.15.7 patch eff4920e4fd674f651f7f7bfcd8edf5f14259634 v5.15.7-427-geff4920
zwei: Intel(R) Core(TM) i7 CPU 920 @ 2.67GHz (GenuineIntel 2668MHz) (x86_64/8 cpu)
on linux - 3.0.0-15-generic [debian]
using g++ version 4.6.1
smoketime 18 hours 27 minutes (average 55 minutes 22 seconds)

Summary: FAIL(F)

O = OK F = Failure(s), extended report at the bottom
X = Failure(s) under TEST but not under harness
? = still running or test results not (yet) available
Build failures during: - = unknown or N/A
c = Configure, m = make, M = make (after miniperl), t = make test-prep

v5.15.7-427-geff4920 Configuration (common) -Dcc=g++ -O
----------- ---------------------------------------------------------
O O O O O O F O -Uusenm
O O O O O O F O -Uusenm -Accflags=-DPERL_POISON
O O O O O O F O -Uusenm -Duse64bitall
O O O O O O F O -Uusenm -Dusemorebits
O O O O O O O O -Uusenm -Dmad
O O O O O O O O -Uusenm -Duseithreads
O O O O O O O O -Uusenm -Duseithreads -Accflags=-DPERL_POISON
O O O O O O O O -Uusenm -Duseithreads -Duse64bitall
O O O O O O O O -Uusenm -Duseithreads -Dusemorebits
O O O O O O O O -Uusenm -Duseithreads -Dmad
| | | | | +- LC_ALL = en_US.utf8 -DDEBUGGING
| | | | +--- PERLIO = perlio -DDEBUGGING
| | | +----- PERLIO = stdio -DDEBUGGING
| | +------- LC_ALL = en_US.utf8
| +--------- PERLIO = perlio
+----------- PERLIO = stdio

Locally applied patches:
uncommitted-changes
SMOKEeff4920e4fd674f651f7f7bfcd8edf5f14259634

Failures: (common-args) -Dcc=g++ -O
[minitest] -DDEBUGGING -Uusenm
[minitest] -DDEBUGGING -Uusenm -Accflags=-DPERL_POISON
[minitest] -DDEBUGGING -Uusenm -Duse64bitall
[minitest] -DDEBUGGING -Uusenm -Dusemorebits
t/re/regexp_qr_embed ........... FAILED--non-zero wait status: 5632

Compiler messages(gcc):
try.c: In function ‘int main()’:
try.c:36:10: warning: ignoring return value of ‘int pipe(int*)’, declared with attribute warn_unused_result [-Wunused-result]
try.c:37:10: warning: ignoring return value of ‘int pipe(int*)’, declared with attribute warn_unused_result [-Wunused-result]
try.c:53:35: warning: ignoring return value of ‘ssize_t write(int, const void*, size_t)’, declared with attribute warn_unused_result [-Wunused-result]
try.c:66:23: warning: ignoring return value of ‘ssize_t write(int, const void*, size_t)’, declared with attribute warn_unused_result [-Wunused-result]
try.c:72:35: warning: ignoring return value of ‘ssize_t write(int, const void*, size_t)’, declared with attribute warn_unused_result [-Wunused-result]
try.c:78:21: warning: ignoring return value of ‘ssize_t read(int, void*, size_t)’, declared with attribute warn_unused_result [-Wunused-result]
try.c: In function ‘int main(int, char**)’:
try.c:22:14: error: ‘KERN_PROC’ was not declared in this scope
try.c:23:14: error: ‘KERN_PROC_PATHNAME’ was not declared in this scope
try.c:48:25: error: invalid conversion from ‘void*’ to ‘char*’ [-fpermissive]
try.c:5785:17: warning: extra tokens at end of #ifdef directive [enabled by default]
try.c:5788:18: warning: extra tokens at end of #ifdef directive [enabled by default]
try.c:5791:19: warning: extra tokens at end of #ifdef directive [enabled by default]
try.c:5794:19: warning: extra tokens at end of #ifdef directive [enabled by default]
try.c:5821:17: warning: extra tokens at end of #ifdef directive [enabled by default]
try.c:5824:18: warning: extra tokens at end of #ifdef directive [enabled by default]
try.c:5827:19: warning: extra tokens at end of #ifdef directive [enabled by default]
try.c:5830:19: warning: extra tokens at end of #ifdef directive [enabled by default]
try.c:5857:17: warning: extra tokens at end of #ifdef directive [enabled by default]
try.c:5860:18: warning: extra tokens at end of #ifdef directive [enabled by default]
try.c:5863:19: warning: extra tokens at end of #ifdef directive [enabled by default]
try.c:5866:19: warning: extra tokens at end of #ifdef directive [enabled by default]
try.c:5893:16: warning: extra tokens at end of #ifdef directive [enabled by default]
try.c:5896:17: warning: extra tokens at end of #ifdef directive [enabled by default]
try.c:5899:18: warning: extra tokens at end of #ifdef directive [enabled by default]
try.c:5902:18: warning: extra tokens at end of #ifdef directive [enabled by default]
try.c:5929:18: warning: extra tokens at end of #ifdef directive [enabled by default]
try.c:5932:19: warning: extra tokens at end of #ifdef directive [enabled by default]
try.c:5935:20: warning: extra tokens at end of #ifdef directive [enabled by default]
try.c:5938:20: warning: extra tokens at end of #ifdef directive [enabled by default]
try.c:6817:18: warning: extra tokens at end of #ifdef directive [enabled by default]
try.c:6820:19: warning: extra tokens at end of #ifdef directive [enabled by default]
try.c:6823:20: warning: extra tokens at end of #ifdef directive [enabled by default]
try.c:6826:20: warning: extra tokens at end of #ifdef directive [enabled by default]
try.c:6853:18: warning: extra tokens at end of #ifdef directive [enabled by default]
try.c:6856:19: warning: extra tokens at end of #ifdef directive [enabled by default]
try.c:6859:20: warning: extra tokens at end of #ifdef directive [enabled by default]
try.c:6862:20: warning: extra tokens at end of #ifdef directive [enabled by default]
try.c:6889:18: warning: extra tokens at end of #ifdef directive [enabled by default]
try.c:6892:19: warning: extra tokens at end of #ifdef directive [enabled by default]
try.c:6895:20: warning: extra tokens at end of #ifdef directive [enabled by default]
try.c:6898:20: warning: extra tokens at end of #ifdef directive [enabled by default]
try.c:6925:17: warning: extra tokens at end of #ifdef directive [enabled by default]
try.c:6928:18: warning: extra tokens at end of #ifdef directive [enabled by default]
try.c:6931:19: warning: extra tokens at end of #ifdef directive [enabled by default]
try.c:6934:19: warning: extra tokens at end of #ifdef directive [enabled by default]
try.c:6961:19: warning: extra tokens at end of #ifdef directive [enabled by default]
try.c:6964:20: warning: extra tokens at end of #ifdef directive [enabled by default]
try.c:6967:21: warning: extra tokens at end of #ifdef directive [enabled by default]
try.c:6970:21: warning: extra tokens at end of #ifdef directive [enabled by default]
regexec.c: In function ‘char* S_find_byclass(regexp*, const regnode*, char*, const char*, regmatch_info*)’:
regexec.c:1601:6: warning: variable ‘ok’ set but not used [-Wunused-but-set-variable]
regexec.c:1607:6: warning: variable ‘ok’ set but not used [-Wunused-but-set-variable]
regexec.c:1612:6: warning: variable ‘ok’ set but not used [-Wunused-but-set-variable]
regexec.c:1622:6: warning: variable ‘ok’ set but not used [-Wunused-but-set-variable]
regexec.c:1632:6: warning: variable ‘ok’ set but not used [-Wunused-but-set-variable]
regexec.c:1637:6: warning: variable ‘ok’ set but not used [-Wunused-but-set-variable]
regexec.c:1648:6: warning: variable ‘ok’ set but not used [-Wunused-but-set-variable]
regexec.c:1655:6: warning: variable ‘ok’ set but not used [-Wunused-but-set-variable]
regexec.c:1667:6: warning: variable ‘ok’ set but not used [-Wunused-but-set-variable]
regexec.c:1674:6: warning: variable ‘ok’ set but not used [-Wunused-but-set-variable]
regexec.c:1693:6: warning: variable ‘ok’ set but not used [-Wunused-but-set-variable]
regexec.c:1700:6: warning: variable ‘ok’ set but not used [-Wunused-but-set-variable]
regexec.c:1718:6: warning: variable ‘ok’ set but not used [-Wunused-but-set-variable]
regexec.c:1725:6: warning: variable ‘ok’ set but not used [-Wunused-but-set-variable]
regexec.c:1744:6: warning: variable ‘ok’ set but not used [-Wunused-but-set-variable]
regexec.c:1762:6: warning: variable ‘ok’ set but not used [-Wunused-but-set-variable]
doio.c: In function ‘void S_exec_failed(const char*, int, int)’:
doio.c:1378:43: warning: ignoring return value of ‘ssize_t write(int, const void*, size_t)’, declared with attribute warn_unused_result [-Wunused-result]
doio.c: In function ‘PerlIOl** Perl_nextargv(GV*)’:
doio.c:872:46: warning: ignoring return value of ‘int fchown(int, __uid_t, __gid_t)’, declared with attribute warn_unused_result [-Wunused-result]
regexec.c: In function ‘I32 S_regmatch(regmatch_info*, regnode*)’:
regexec.c:3754:7: warning: variable ‘ok’ set but not used [-Wunused-but-set-variable]
regexec.c:3830:9: warning: variable ‘ok’ set but not used [-Wunused-but-set-variable]
regexec.c:3834:1: warning: variable ‘ok’ set but not used [-Wunused-but-set-variable]
regexec.c:3836:9: warning: variable ‘ok’ set but not used [-Wunused-but-set-variable]
regexec.c:3840:1: warning: variable ‘ok’ set but not used [-Wunused-but-set-variable]
regexec.c:3842:9: warning: variable ‘ok’ set but not used [-Wunused-but-set-variable]
regexec.c:3845:1: warning: variable ‘ok’ set but not used [-Wunused-but-set-variable]
regexec.c:3930:7: warning: variable ‘ok’ set but not used [-Wunused-but-set-variable]
regexec.c:3930:1: warning: variable ‘ok’ set but not used [-Wunused-but-set-variable]
regexec.c:3930:1: warning: variable ‘throw_away’ set but not used [-Wunused-but-set-variable]
regexec.c: In function ‘I32 S_regrepeat(const regexp*, const regnode*, I32, int)’:
regexec.c:6114:6: warning: variable ‘ok’ set but not used [-Wunused-but-set-variable]
regexec.c:6159:6: warning: variable ‘ok’ set but not used [-Wunused-but-set-variable]
regexec.c:6211:6: warning: variable ‘ok’ set but not used [-Wunused-but-set-variable]
regexec.c:6260:6: warning: variable ‘ok’ set but not used [-Wunused-but-set-variable]
regexec.c:6313:6: warning: variable ‘ok’ set but not used [-Wunused-but-set-variable]
regexec.c:6346:6: warning: variable ‘ok’ set but not used [-Wunused-but-set-variable]
util.c: In function ‘char* S_write_no_mem()’:
util.c:68:34: warning: ignoring return value of ‘ssize_t write(int, const void*, size_t)’, declared with attribute warn_unused_result [-Wunused-result]
perlio.c: In function ‘void S_more_refcounted_fds(int)’:
perlio.c:2348:38: warning: ignoring return value of ‘ssize_t write(int, const void*, size_t)’, declared with attribute warn_unused_result [-Wunused-result]
pp_ctl.c: In function ‘OP* Perl_pp_goto()’:
pp_ctl.c:2913:8: warning: variable ‘newsp’ set but not used [-Wunused-but-set-variable]
pp_ctl.c:2914:7: warning: variable ‘gimme’ set but not used [-Wunused-but-set-variable]
perlio.c: In function ‘void PerlIO_debug(const char*, ...)’:
perlio.c:491:43: warning: ignoring return value of ‘ssize_t write(int, const void*, size_t)’, declared with attribute warn_unused_result [-Wunused-result]
mg_vtable.h:98:54: warning: ‘PL_magic_vtable_names’ initialized and declared ‘extern’ [enabled by default]
sv.c: In function ‘void Perl_sv_vcatpvfn(SV*, const char*, STRLEN, __va_list_tag (*)[1], SV**, I32, bool*)’:
sv.c:10104:41: warning: ignoring return value of ‘char* gcvt(double, int, char*)’, declared with attribute warn_unused_result [-Wunused-result]
sv.c:10953:53: warning: ignoring return value of ‘char* gcvt(double, int, char*)’, declared with attribute warn_unused_result [-Wunused-result]
regcomp.c: In function ‘regnode* S_regclass(RExC_state_t*, U32)’:
regcomp.c:10847:7: warning: ignoring return value of ‘regex_charset get_regex_charset(U32)’, declared with attribute warn_unused_result [-Wunused-result]
sv.c: In function ‘char* Perl_sv_2pv_flags(SV*, STRLEN*, I32)’:
sv.c:2750:39: warning: ignoring return value of ‘char* gcvt(double, int, char*)’, declared with attribute warn_unused_result [-Wunused-result]
sv.c:2942:39: warning: ignoring return value of ‘char* gcvt(double, int, char*)’, declared with attribute warn_unused_result [-Wunused-result]
sdbm.c: In function ‘int makroom(DBM*, long int, int)’:
sdbm.c:371:70: warning: ignoring return value of ‘ssize_t write(int, const void*, size_t)’, declared with attribute warn_unused_result [-Wunused-result]
Call.xs: In function ‘I32 filter_call(int, SV*, int)’:
Call.xs:63:58: warning: format ‘%d’ expects argument of type ‘int’, but argument 3 has type ‘STRLEN {aka long unsigned int}’ [-Wformat]
Call.xs:63:58: warning: format ‘%d’ expects argument of type ‘int’, but argument 5 has type ‘STRLEN {aka long unsigned int}’ [-Wformat]
Call.xs:100:41: warning: format ‘%d’ expects argument of type ‘int’, but argument 4 has type ‘STRLEN {aka long unsigned int}’ [-Wformat]
Call.xs:156:38: warning: format ‘%d’ expects argument of type ‘int’, but argument 3 has type ‘STRLEN {aka long unsigned int}’ [-Wformat]
Call.xs:175:51: warning: format ‘%d’ expects argument of type ‘int’, but argument 4 has type ‘long unsigned int’ [-Wformat]
re_comp.c: In function ‘regnode* S_regclass(RExC_state_t*, U32)’:
re_comp.c:10847:7: warning: ignoring return value of ‘regex_charset get_regex_charset(U32)’, declared with attribute warn_unused_result [-Wunused-result]
regcomp.c: In function ‘void S_dump_trie(const _reg_trie_data*, HV*, AV*, U32)’:
regcomp.c:1041:5: warning: variable ‘re_debug_flags’ set but not used [-Wunused-but-set-variable]
regcomp.c: In function ‘void S_dump_trie_interim_list(const _reg_trie_data*, HV*, AV*, U32, U32)’:
regcomp.c:1132:5: warning: variable ‘re_debug_flags’ set but not used [-Wunused-but-set-variable]
regcomp.c: In function ‘void S_dump_trie_interim_table(const _reg_trie_data*, HV*, AV*, U32, U32)’:
regcomp.c:1190:5: warning: variable ‘re_debug_flags’ set but not used [-Wunused-but-set-variable]
regcomp.c: In function ‘REGEXP* Perl_re_compile(SV*, U32)’:
regcomp.c:5646:5: warning: variable ‘re_debug_flags’ set but not used [-Wunused-but-set-variable]
regcomp.c: In function ‘SV* Perl_reg_named_buff_nextkey(REGEXP*, U32)’:
regcomp.c:5796:5: warning: variable ‘re_debug_flags’ set but not used [-Wunused-but-set-variable]
regcomp.c: In function ‘void Perl_pregfree2(REGEXP*)’:
regcomp.c:12589:5: warning: variable ‘re_debug_flags’ set but not used [-Wunused-but-set-variable]
sv.c:10953:53: warning: ignoring return value of ‘char* qgcvt(long double, int, char*)’, declared with attribute warn_unused_result [-Wunused-result]
sv.c:2750:39: warning: ignoring return value of ‘char* qgcvt(long double, int, char*)’, declared with attribute warn_unused_result [-Wunused-result]
sv.c:2942:39: warning: ignoring return value of ‘char* qgcvt(long double, int, char*)’, declared with attribute warn_unused_result [-Wunused-result]
toke.c: In function ‘int Perl_yylex()’:
toke.c:8051:19: warning: variable ‘have_proto’ set but not used [-Wunused-but-set-variable]
regexec.c: In function ‘char* S_find_byclass(PerlInterpreter*, regexp*, const regnode*, char*, const char*, regmatch_info*)’:
pp_ctl.c: In function ‘OP* Perl_pp_goto(PerlInterpreter*)’:
regexec.c: In function ‘I32 S_regmatch(PerlInterpreter*, regmatch_info*, regnode*)’:
regexec.c:3754:1: warning: variable ‘ok’ set but not used [-Wunused-but-set-variable]
doio.c: In function ‘void S_exec_failed(PerlInterpreter*, const char*, int, int)’:
perlio.c: In function ‘void S_more_refcounted_fds(PerlInterpreter*, int)’:
doio.c: In function ‘PerlIOl** Perl_nextargv(PerlInterpreter*, GV*)’:
regexec.c: In function ‘I32 S_regrepeat(PerlInterpreter*, const regexp*, const regnode*, I32, int)’:
regexec.c:6114:1: warning: variable ‘ok’ set but not used [-Wunused-but-set-variable]
regexec.c:6159:1: warning: variable ‘ok’ set but not used [-Wunused-but-set-variable]
regexec.c:6211:1: warning: variable ‘ok’ set but not used [-Wunused-but-set-variable]
regexec.c:6260:1: warning: variable ‘ok’ set but not used [-Wunused-but-set-variable]
regexec.c:6313:1: warning: variable ‘ok’ set but not used [-Wunused-but-set-variable]
regexec.c:6346:1: warning: variable ‘ok’ set but not used [-Wunused-but-set-variable]
perlio.c:482:56: warning: ignoring return value of ‘ssize_t write(int, const void*, size_t)’, declared with attribute warn_unused_result [-Wunused-result]
util.c: In function ‘char* S_write_no_mem(PerlInterpreter*)’:
perl.c: In function ‘void S_init_tls_and_interp(PerlInterpreter*)’:
perl.c:105:2: warning: ignoring return value of ‘ssize_t write(int, const void*, size_t)’, declared with attribute warn_unused_result [-Wunused-result]
sv.c: In function ‘DIR* Perl_dirp_dup(PerlInterpreter*, DIR*, CLONE_PARAMS*)’:
sv.c:11400:26: warning: ignoring return value of ‘int fchdir(int)’, declared with attribute warn_unused_result [-Wunused-result]
sv.c: In function ‘void Perl_sv_vcatpvfn(PerlInterpreter*, SV*, const char*, STRLEN, __va_list_tag (*)[1], SV**, I32, bool*)’:
regcomp.c: In function ‘regnode* S_regclass(PerlInterpreter*, RExC_state_t*, U32)’:
sv.c: In function ‘char* Perl_sv_2pv_flags(PerlInterpreter*, SV*, STRLEN*, I32)’:
Call.xs: In function ‘I32 filter_call(PerlInterpreter*, int, SV*, int)’:
shared.xs: In function ‘user_lock* S_get_userlock(PerlInterpreter*, SV*, bool)’:
shared.xs:348:5: warning: deprecated conversion from string constant to ‘char*’ [-Wwrite-strings]
shared.xs: In function ‘void S_sharedsv_dec(PerlInterpreter*, SV*)’:
shared.xs:521:5: warning: deprecated conversion from string constant to ‘char*’ [-Wwrite-strings]
shared.xs: In function ‘void Perl_sharedsv_share(PerlInterpreter*, SV*)’:
shared.xs:550:9: warning: deprecated conversion from string constant to ‘char*’ [-Wwrite-strings]
shared.xs: In function ‘int sharedsv_scalar_mg_get(PerlInterpreter*, SV*, MAGIC*)’:
shared.xs:725:5: warning: deprecated conversion from string constant to ‘char*’ [-Wwrite-strings]
shared.xs: In function ‘int sharedsv_scalar_mg_set(PerlInterpreter*, SV*, MAGIC*)’:
shared.xs:803:5: warning: deprecated conversion from string constant to ‘char*’ [-Wwrite-strings]
shared.xs: In function ‘int sharedsv_scalar_mg_free(PerlInterpreter*, SV*, MAGIC*)’:
shared.xs:821:5: warning: deprecated conversion from string constant to ‘char*’ [-Wwrite-strings]
shared.xs: In function ‘int sharedsv_scalar_mg_local(PerlInterpreter*, SV*, MAGIC*)’:
shared.xs:854:9: warning: deprecated conversion from string constant to ‘char*’ [-Wwrite-strings]
shared.xs: In function ‘int sharedsv_elem_mg_FETCH(PerlInterpreter*, SV*, MAGIC*)’:
shared.xs:891:5: warning: deprecated conversion from string constant to ‘char*’ [-Wwrite-strings]
shared.xs: In function ‘int sharedsv_elem_mg_STORE(PerlInterpreter*, SV*, MAGIC*)’:
shared.xs:944:5: warning: deprecated conversion from string constant to ‘char*’ [-Wwrite-strings]
shared.xs: In function ‘int sharedsv_elem_mg_DELETE(PerlInterpreter*, SV*, MAGIC*)’:
shared.xs:986:5: warning: deprecated conversion from string constant to ‘char*’ [-Wwrite-strings]
shared.xs: In function ‘U32 sharedsv_array_mg_FETCHSIZE(PerlInterpreter*, SV*, MAGIC*)’:
shared.xs:1049:5: warning: deprecated conversion from string constant to ‘char*’ [-Wwrite-strings]
shared.xs: In function ‘int sharedsv_array_mg_CLEAR(PerlInterpreter*, SV*, MAGIC*)’:
shared.xs:1069:5: warning: deprecated conversion from string constant to ‘char*’ [-Wwrite-strings]
shared.xs: In function ‘void Perl_sharedsv_lock(PerlInterpreter*, SV*)’:
shared.xs:1173:63: warning: deprecated conversion from string constant to ‘char*’ [-Wwrite-strings]
shared.xs: In function ‘void XS_threads__shared__tie_PUSH(PerlInterpreter*, CV*)’:
shared.xs:1269:13: warning: deprecated conversion from string constant to ‘char*’ [-Wwrite-strings]
shared.xs: In function ‘void XS_threads__shared__tie_UNSHIFT(PerlInterpreter*, CV*)’:
shared.xs:1286:9: warning: deprecated conversion from string constant to ‘char*’ [-Wwrite-strings]
shared.xs: In function ‘void XS_threads__shared__tie_POP(PerlInterpreter*, CV*)’:
shared.xs:1309:9: warning: deprecated conversion from string constant to ‘char*’ [-Wwrite-strings]
shared.xs: In function ‘void XS_threads__shared__tie_SHIFT(PerlInterpreter*, CV*)’:
shared.xs:1326:9: warning: deprecated conversion from string constant to ‘char*’ [-Wwrite-strings]
shared.xs: In function ‘void XS_threads__shared__tie_EXTEND(PerlInterpreter*, CV*)’:
shared.xs:1342:9: warning: deprecated conversion from string constant to ‘char*’ [-Wwrite-strings]
shared.xs: In function ‘void XS_threads__shared__tie_STORESIZE(PerlInterpreter*, CV*)’:
shared.xs:1352:9: warning: deprecated conversion from string constant to ‘char*’ [-Wwrite-strings]
shared.xs: In function ‘void XS_threads__shared__tie_EXISTS(PerlInterpreter*, CV*)’:
shared.xs:1364:13: warning: deprecated conversion from string constant to ‘char*’ [-Wwrite-strings]
shared.xs:1374:13: warning: deprecated conversion from string constant to ‘char*’ [-Wwrite-strings]
shared.xs: In function ‘void XS_threads__shared__tie_FIRSTKEY(PerlInterpreter*, CV*)’:
shared.xs:1390:9: warning: deprecated conversion from string constant to ‘char*’ [-Wwrite-strings]
shared.xs: In function ‘void XS_threads__shared__tie_NEXTKEY(PerlInterpreter*, CV*)’:
shared.xs:1418:9: warning: deprecated conversion from string constant to ‘char*’ [-Wwrite-strings]
shared.xs: In function ‘void XS_threads__shared_bless(PerlInterpreter*, CV*)’:
shared.xs:1678:13: warning: deprecated conversion from string constant to ‘char*’ [-Wwrite-strings]
re_comp.c: In function ‘regnode* S_regclass(PerlInterpreter*, RExC_state_t*, U32)’:
threads.xs: In function ‘ithread* S_ithread_create(PerlInterpreter*, SV*, IV, int, int, int, int)’:
threads.xs:714:83: warning: ignoring return value of ‘ssize_t write(int, const void*, size_t)’, declared with attribute warn_unused_result [-Wunused-result]
regcomp.c: In function ‘void S_dump_trie(PerlInterpreter*, const _reg_trie_data*, HV*, AV*, U32)’:
regcomp.c: In function ‘void S_dump_trie_interim_list(PerlInterpreter*, const _reg_trie_data*, HV*, AV*, U32, U32)’:
regcomp.c: In function ‘void S_dump_trie_interim_table(PerlInterpreter*, const _reg_trie_data*, HV*, AV*, U32, U32)’:
regcomp.c: In function ‘REGEXP* Perl_re_compile(PerlInterpreter*, SV*, U32)’:
regcomp.c: In function ‘SV* Perl_reg_named_buff_nextkey(PerlInterpreter*, REGEXP*, U32)’:
regcomp.c: In function ‘void Perl_pregfree2(PerlInterpreter*, REGEXP*)’:
toke.c: In function ‘int Perl_yylex(PerlInterpreter*)’:
--
Report by Test::Smoke v1.44 build 1285 running on perl 5.12.4
(Reporter v0.035 / Smoker v0.045)

Perl porters RSS feed   Index | Next | Previous | View Threaded
 
 


Interested in having your list archived? Contact Gossamer Threads
 
  Web Applications & Managed Hosting Powered by Gossamer Threads Inc.