Login | Register For Free | Help
Search for: (Advanced)

Mailing List Archive: MythTV: Dev

ARM compile: libmythtv-0.25.so: undefined reference

 

 

MythTV dev RSS feed   Index | Next | Previous | View Threaded


parrisimo at gmail

Jul 15, 2012, 9:12 AM

Post #1 of 1 (612 views)
Permalink
ARM compile: libmythtv-0.25.so: undefined reference

Trying to compile 0.25 on ARM-based processor. I'm having a similar to
issue reported on Ticket #10588 <http://code.mythtv.org/trac/ticket/10588> (see
below for error). I get this same error seen below for 0.25, 0.25.1, and
0.25fixes, but the current master compiles successfully. Also in the
master branch I checked out the code dating from the same time 0.25.1 was
released and am successful on the compile. 0.24 versions are successful.
Any thoughts on why master 0.26pre compiles but the 0.25 versions get
stuck with mythavtest?

Thanks!

make[2]: Entering directory
`/share/MD0_DATA/src/mythtv-0.25fixes/mythtv/programs/mythavtest'
g++ -Wl,-rpath,/opt/Qt-4.7.3/lib -o mythavtest main.o commandlineparser.o
-L../../libs/libmyth -L../../libs/libmythtv
-L../../external/FFmpeg/libavutil -L../../external/FFmpeg/libavcodec
-L../../external/FFmpeg/libavformat -L../../external/FFmpeg/libswscale
-L../../libs/libmythbase -L../../libs/libmythui -L../../libs/libmythupnp
-L../../libs/libmythmetadata -L../../libs/libmythservicecontracts
-L../../libs/libmythprotoserver -lmythtv-0.25 -lmythswscale -lmythavformat
-lmythavcodec -lmythavutil -lmythupnp-0.25 -lmythbase-0.25 -lmythui-0.25
-lmyth-0.25 -lmythmetadata-0.25 -lmythservicecontracts-0.25
-lmythprotoserver-0.25 -L../../libs/libmythlivemedia -lmythlivemedia-0.25
-L../../libs/libmythfreemheg -lmythfreemheg-0.25
-L../../libs/libmythhdhomerun -lmythhdhomerun-0.25 -lXext -lX11 -lxml2
-lmp3lame -L/opt/lib -lm -lbz2 -lrt -ldl -lfreetype -lz -L/usr/X11R6/lib
-L/opt/MythTV-0.25fixes/lib -L/opt/Qt-4.7.3/lib -lQtSql -lQtXml -lQtGui
-lQtNetwork -lQtCore -lpthread
../../libs/libmythtv/libmythtv-0.25.so: undefined reference to
`__aeabi_d2lz [at] LIBAVCODEC_5'
collect2: ld returned 1 exit status
make[2]: *** [mythavtest] Error 1
make[2]: Leaving directory
`/share/MD0_DATA/src/mythtv-0.25fixes/mythtv/programs/mythavtest'
make[1]: *** [sub-mythavtest-make_default] Error 2
make[1]: Leaving directory
`/share/MD0_DATA/src/mythtv-0.25fixes/mythtv/programs'
make: *** [programs] Error 2

MythTV dev RSS feed   Index | Next | Previous | View Threaded
 
 


Interested in having your list archived? Contact Gossamer Threads
 
  Web Applications & Managed Hosting Powered by Gossamer Threads Inc.