Login | Register For Free | Help
Search for: (Advanced)

Mailing List Archive: Lucene: Java-Dev

[JENKINS] Lucene-Solr-trunk-Linux (64bit/jdk1.7.0_07) - Build # 1170 - Failure!

 

 

Lucene java-dev RSS feed   Index | Next | Previous | View Threaded


jenkins at sd-datasolutions

Sep 16, 2012, 10:13 PM

Post #1 of 1 (86 views)
Permalink
[JENKINS] Lucene-Solr-trunk-Linux (64bit/jdk1.7.0_07) - Build # 1170 - Failure!

Build: http://jenkins.sd-datasolutions.de/job/Lucene-Solr-trunk-Linux/1170/
Java: 64bit/jdk1.7.0_07 -XX:+UseConcMarkSweepGC

4 tests failed.
REGRESSION: org.apache.solr.search.TestSolr4Spatial.checkQueryEmptyIndex {p0=srpt_geohash}

Error Message:
Exception during query

Stack Trace:
java.lang.RuntimeException: Exception during query
at __randomizedtesting.SeedInfo.seed([A43ACD08EAE49210:A4F046E521861550]:0)
at org.apache.solr.SolrTestCaseJ4.assertQ(SolrTestCaseJ4.java:503)
at org.apache.solr.SolrTestCaseJ4.assertQ(SolrTestCaseJ4.java:470)
at org.apache.solr.search.TestSolr4Spatial.checkHits(TestSolr4Spatial.java:170)
at org.apache.solr.search.TestSolr4Spatial.checkHits(TestSolr4Spatial.java:139)
at org.apache.solr.search.TestSolr4Spatial.checkQueryEmptyIndex(TestSolr4Spatial.java:135)
at sun.reflect.NativeMethodAccessorImpl.invoke0(Native Method)
at sun.reflect.NativeMethodAccessorImpl.invoke(NativeMethodAccessorImpl.java:57)
at sun.reflect.DelegatingMethodAccessorImpl.invoke(DelegatingMethodAccessorImpl.java:43)
at java.lang.reflect.Method.invoke(Method.java:601)
at com.carrotsearch.randomizedtesting.RandomizedRunner.invoke(RandomizedRunner.java:1559)
at com.carrotsearch.randomizedtesting.RandomizedRunner.access$600(RandomizedRunner.java:79)
at com.carrotsearch.randomizedtesting.RandomizedRunner$6.evaluate(RandomizedRunner.java:737)
at com.carrotsearch.randomizedtesting.RandomizedRunner$7.evaluate(RandomizedRunner.java:773)
at com.carrotsearch.randomizedtesting.RandomizedRunner$8.evaluate(RandomizedRunner.java:787)
at com.carrotsearch.randomizedtesting.rules.SystemPropertiesRestoreRule$1.evaluate(SystemPropertiesRestoreRule.java:53)
at org.apache.lucene.util.TestRuleSetupTeardownChained$1.evaluate(TestRuleSetupTeardownChained.java:50)
at org.apache.lucene.util.TestRuleFieldCacheSanity$1.evaluate(TestRuleFieldCacheSanity.java:51)
at org.apache.lucene.util.AbstractBeforeAfterRule$1.evaluate(AbstractBeforeAfterRule.java:45)
at com.carrotsearch.randomizedtesting.rules.SystemPropertiesInvariantRule$1.evaluate(SystemPropertiesInvariantRule.java:55)
at org.apache.lucene.util.TestRuleThreadAndTestName$1.evaluate(TestRuleThreadAndTestName.java:48)
at org.apache.lucene.util.TestRuleIgnoreAfterMaxFailures$1.evaluate(TestRuleIgnoreAfterMaxFailures.java:70)
at org.apache.lucene.util.TestRuleMarkFailure$1.evaluate(TestRuleMarkFailure.java:48)
at com.carrotsearch.randomizedtesting.rules.StatementAdapter.evaluate(StatementAdapter.java:36)
at com.carrotsearch.randomizedtesting.ThreadLeakControl$StatementRunner.run(ThreadLeakControl.java:358)
at com.carrotsearch.randomizedtesting.ThreadLeakControl.forkTimeoutingTask(ThreadLeakControl.java:782)
at com.carrotsearch.randomizedtesting.ThreadLeakControl$3.evaluate(ThreadLeakControl.java:442)
at com.carrotsearch.randomizedtesting.RandomizedRunner.runSingleTest(RandomizedRunner.java:746)
at com.carrotsearch.randomizedtesting.RandomizedRunner$3.evaluate(RandomizedRunner.java:648)
at com.carrotsearch.randomizedtesting.RandomizedRunner$4.evaluate(RandomizedRunner.java:682)
at com.carrotsearch.randomizedtesting.RandomizedRunner$5.evaluate(RandomizedRunner.java:693)
at com.carrotsearch.randomizedtesting.rules.StatementAdapter.evaluate(StatementAdapter.java:36)
at com.carrotsearch.randomizedtesting.rules.SystemPropertiesRestoreRule$1.evaluate(SystemPropertiesRestoreRule.java:53)
at org.apache.lucene.util.AbstractBeforeAfterRule$1.evaluate(AbstractBeforeAfterRule.java:45)
at org.apache.lucene.util.TestRuleStoreClassName$1.evaluate(TestRuleStoreClassName.java:42)
at com.carrotsearch.randomizedtesting.rules.SystemPropertiesInvariantRule$1.evaluate(SystemPropertiesInvariantRule.java:55)
at com.carrotsearch.randomizedtesting.rules.NoShadowingOrOverridesOnMethodsRule$1.evaluate(NoShadowingOrOverridesOnMethodsRule.java:39)
at com.carrotsearch.randomizedtesting.rules.NoShadowingOrOverridesOnMethodsRule$1.evaluate(NoShadowingOrOverridesOnMethodsRule.java:39)
at com.carrotsearch.randomizedtesting.rules.StatementAdapter.evaluate(StatementAdapter.java:36)
at org.apache.lucene.util.TestRuleAssertionsRequired$1.evaluate(TestRuleAssertionsRequired.java:43)
at org.apache.lucene.util.TestRuleMarkFailure$1.evaluate(TestRuleMarkFailure.java:48)
at org.apache.lucene.util.TestRuleIgnoreAfterMaxFailures$1.evaluate(TestRuleIgnoreAfterMaxFailures.java:70)
at org.apache.lucene.util.TestRuleIgnoreTestSuites$1.evaluate(TestRuleIgnoreTestSuites.java:55)
at com.carrotsearch.randomizedtesting.rules.StatementAdapter.evaluate(StatementAdapter.java:36)
at com.carrotsearch.randomizedtesting.ThreadLeakControl$StatementRunner.run(ThreadLeakControl.java:358)
at java.lang.Thread.run(Thread.java:722)
Caused by: java.lang.RuntimeException: REQUEST FAILED: xpath=*[count(//doc)=0]
xml response was: <?xml version="1.0" encoding="UTF-8"?>
<response>
<lst name="responseHeader"><int name="status">0</int><int name="QTime">2</int></lst><result name="response" numFound="3" start="0"><doc><str name="id">5</str></doc><doc><str name="id">6</str></doc><doc><str name="id">7</str></doc></result>
</response>

request was:fl=id&q=*:*&fq={!field+f%3Dsrpt_geohash+score%3Dnone}Intersects(Circle(0,0+d%3D0.8993203677616635))&rows=1000
at org.apache.solr.SolrTestCaseJ4.assertQ(SolrTestCaseJ4.java:496)
... 44 more


REGRESSION: org.apache.solr.search.TestSolr4Spatial.checkQueryEmptyIndex {p0=srpt_quad}

Error Message:
Exception during query

Stack Trace:
java.lang.RuntimeException: Exception during query
at __randomizedtesting.SeedInfo.seed([A43ACD08EAE49210:A4F046E521861550]:0)
at org.apache.solr.SolrTestCaseJ4.assertQ(SolrTestCaseJ4.java:503)
at org.apache.solr.SolrTestCaseJ4.assertQ(SolrTestCaseJ4.java:470)
at org.apache.solr.search.TestSolr4Spatial.checkHits(TestSolr4Spatial.java:170)
at org.apache.solr.search.TestSolr4Spatial.checkHits(TestSolr4Spatial.java:139)
at org.apache.solr.search.TestSolr4Spatial.checkQueryEmptyIndex(TestSolr4Spatial.java:135)
at sun.reflect.NativeMethodAccessorImpl.invoke0(Native Method)
at sun.reflect.NativeMethodAccessorImpl.invoke(NativeMethodAccessorImpl.java:57)
at sun.reflect.DelegatingMethodAccessorImpl.invoke(DelegatingMethodAccessorImpl.java:43)
at java.lang.reflect.Method.invoke(Method.java:601)
at com.carrotsearch.randomizedtesting.RandomizedRunner.invoke(RandomizedRunner.java:1559)
at com.carrotsearch.randomizedtesting.RandomizedRunner.access$600(RandomizedRunner.java:79)
at com.carrotsearch.randomizedtesting.RandomizedRunner$6.evaluate(RandomizedRunner.java:737)
at com.carrotsearch.randomizedtesting.RandomizedRunner$7.evaluate(RandomizedRunner.java:773)
at com.carrotsearch.randomizedtesting.RandomizedRunner$8.evaluate(RandomizedRunner.java:787)
at com.carrotsearch.randomizedtesting.rules.SystemPropertiesRestoreRule$1.evaluate(SystemPropertiesRestoreRule.java:53)
at org.apache.lucene.util.TestRuleSetupTeardownChained$1.evaluate(TestRuleSetupTeardownChained.java:50)
at org.apache.lucene.util.TestRuleFieldCacheSanity$1.evaluate(TestRuleFieldCacheSanity.java:51)
at org.apache.lucene.util.AbstractBeforeAfterRule$1.evaluate(AbstractBeforeAfterRule.java:45)
at com.carrotsearch.randomizedtesting.rules.SystemPropertiesInvariantRule$1.evaluate(SystemPropertiesInvariantRule.java:55)
at org.apache.lucene.util.TestRuleThreadAndTestName$1.evaluate(TestRuleThreadAndTestName.java:48)
at org.apache.lucene.util.TestRuleIgnoreAfterMaxFailures$1.evaluate(TestRuleIgnoreAfterMaxFailures.java:70)
at org.apache.lucene.util.TestRuleMarkFailure$1.evaluate(TestRuleMarkFailure.java:48)
at com.carrotsearch.randomizedtesting.rules.StatementAdapter.evaluate(StatementAdapter.java:36)
at com.carrotsearch.randomizedtesting.ThreadLeakControl$StatementRunner.run(ThreadLeakControl.java:358)
at com.carrotsearch.randomizedtesting.ThreadLeakControl.forkTimeoutingTask(ThreadLeakControl.java:782)
at com.carrotsearch.randomizedtesting.ThreadLeakControl$3.evaluate(ThreadLeakControl.java:442)
at com.carrotsearch.randomizedtesting.RandomizedRunner.runSingleTest(RandomizedRunner.java:746)
at com.carrotsearch.randomizedtesting.RandomizedRunner$3.evaluate(RandomizedRunner.java:648)
at com.carrotsearch.randomizedtesting.RandomizedRunner$4.evaluate(RandomizedRunner.java:682)
at com.carrotsearch.randomizedtesting.RandomizedRunner$5.evaluate(RandomizedRunner.java:693)
at com.carrotsearch.randomizedtesting.rules.StatementAdapter.evaluate(StatementAdapter.java:36)
at com.carrotsearch.randomizedtesting.rules.SystemPropertiesRestoreRule$1.evaluate(SystemPropertiesRestoreRule.java:53)
at org.apache.lucene.util.AbstractBeforeAfterRule$1.evaluate(AbstractBeforeAfterRule.java:45)
at org.apache.lucene.util.TestRuleStoreClassName$1.evaluate(TestRuleStoreClassName.java:42)
at com.carrotsearch.randomizedtesting.rules.SystemPropertiesInvariantRule$1.evaluate(SystemPropertiesInvariantRule.java:55)
at com.carrotsearch.randomizedtesting.rules.NoShadowingOrOverridesOnMethodsRule$1.evaluate(NoShadowingOrOverridesOnMethodsRule.java:39)
at com.carrotsearch.randomizedtesting.rules.NoShadowingOrOverridesOnMethodsRule$1.evaluate(NoShadowingOrOverridesOnMethodsRule.java:39)
at com.carrotsearch.randomizedtesting.rules.StatementAdapter.evaluate(StatementAdapter.java:36)
at org.apache.lucene.util.TestRuleAssertionsRequired$1.evaluate(TestRuleAssertionsRequired.java:43)
at org.apache.lucene.util.TestRuleMarkFailure$1.evaluate(TestRuleMarkFailure.java:48)
at org.apache.lucene.util.TestRuleIgnoreAfterMaxFailures$1.evaluate(TestRuleIgnoreAfterMaxFailures.java:70)
at org.apache.lucene.util.TestRuleIgnoreTestSuites$1.evaluate(TestRuleIgnoreTestSuites.java:55)
at com.carrotsearch.randomizedtesting.rules.StatementAdapter.evaluate(StatementAdapter.java:36)
at com.carrotsearch.randomizedtesting.ThreadLeakControl$StatementRunner.run(ThreadLeakControl.java:358)
at java.lang.Thread.run(Thread.java:722)
Caused by: java.lang.RuntimeException: REQUEST FAILED: xpath=*[count(//doc)=0]
xml response was: <?xml version="1.0" encoding="UTF-8"?>
<response>
<lst name="responseHeader"><int name="status">0</int><int name="QTime">8</int></lst><result name="response" numFound="3" start="0"><doc><str name="id">5</str></doc><doc><str name="id">6</str></doc><doc><str name="id">7</str></doc></result>
</response>

request was:fl=id&q=*:*&fq={!field+f%3Dsrpt_quad+score%3Dnone}Intersects(Circle(0,0+d%3D0.8993203677616635))&rows=1000
at org.apache.solr.SolrTestCaseJ4.assertQ(SolrTestCaseJ4.java:496)
... 44 more


REGRESSION: org.apache.solr.search.TestSolr4Spatial.checkQueryEmptyIndex {p0=stqpt_geohash}

Error Message:
Exception during query

Stack Trace:
java.lang.RuntimeException: Exception during query
at __randomizedtesting.SeedInfo.seed([A43ACD08EAE49210:A4F046E521861550]:0)
at org.apache.solr.SolrTestCaseJ4.assertQ(SolrTestCaseJ4.java:503)
at org.apache.solr.SolrTestCaseJ4.assertQ(SolrTestCaseJ4.java:470)
at org.apache.solr.search.TestSolr4Spatial.checkHits(TestSolr4Spatial.java:170)
at org.apache.solr.search.TestSolr4Spatial.checkHits(TestSolr4Spatial.java:139)
at org.apache.solr.search.TestSolr4Spatial.checkQueryEmptyIndex(TestSolr4Spatial.java:135)
at sun.reflect.NativeMethodAccessorImpl.invoke0(Native Method)
at sun.reflect.NativeMethodAccessorImpl.invoke(NativeMethodAccessorImpl.java:57)
at sun.reflect.DelegatingMethodAccessorImpl.invoke(DelegatingMethodAccessorImpl.java:43)
at java.lang.reflect.Method.invoke(Method.java:601)
at com.carrotsearch.randomizedtesting.RandomizedRunner.invoke(RandomizedRunner.java:1559)
at com.carrotsearch.randomizedtesting.RandomizedRunner.access$600(RandomizedRunner.java:79)
at com.carrotsearch.randomizedtesting.RandomizedRunner$6.evaluate(RandomizedRunner.java:737)
at com.carrotsearch.randomizedtesting.RandomizedRunner$7.evaluate(RandomizedRunner.java:773)
at com.carrotsearch.randomizedtesting.RandomizedRunner$8.evaluate(RandomizedRunner.java:787)
at com.carrotsearch.randomizedtesting.rules.SystemPropertiesRestoreRule$1.evaluate(SystemPropertiesRestoreRule.java:53)
at org.apache.lucene.util.TestRuleSetupTeardownChained$1.evaluate(TestRuleSetupTeardownChained.java:50)
at org.apache.lucene.util.TestRuleFieldCacheSanity$1.evaluate(TestRuleFieldCacheSanity.java:51)
at org.apache.lucene.util.AbstractBeforeAfterRule$1.evaluate(AbstractBeforeAfterRule.java:45)
at com.carrotsearch.randomizedtesting.rules.SystemPropertiesInvariantRule$1.evaluate(SystemPropertiesInvariantRule.java:55)
at org.apache.lucene.util.TestRuleThreadAndTestName$1.evaluate(TestRuleThreadAndTestName.java:48)
at org.apache.lucene.util.TestRuleIgnoreAfterMaxFailures$1.evaluate(TestRuleIgnoreAfterMaxFailures.java:70)
at org.apache.lucene.util.TestRuleMarkFailure$1.evaluate(TestRuleMarkFailure.java:48)
at com.carrotsearch.randomizedtesting.rules.StatementAdapter.evaluate(StatementAdapter.java:36)
at com.carrotsearch.randomizedtesting.ThreadLeakControl$StatementRunner.run(ThreadLeakControl.java:358)
at com.carrotsearch.randomizedtesting.ThreadLeakControl.forkTimeoutingTask(ThreadLeakControl.java:782)
at com.carrotsearch.randomizedtesting.ThreadLeakControl$3.evaluate(ThreadLeakControl.java:442)
at com.carrotsearch.randomizedtesting.RandomizedRunner.runSingleTest(RandomizedRunner.java:746)
at com.carrotsearch.randomizedtesting.RandomizedRunner$3.evaluate(RandomizedRunner.java:648)
at com.carrotsearch.randomizedtesting.RandomizedRunner$4.evaluate(RandomizedRunner.java:682)
at com.carrotsearch.randomizedtesting.RandomizedRunner$5.evaluate(RandomizedRunner.java:693)
at com.carrotsearch.randomizedtesting.rules.StatementAdapter.evaluate(StatementAdapter.java:36)
at com.carrotsearch.randomizedtesting.rules.SystemPropertiesRestoreRule$1.evaluate(SystemPropertiesRestoreRule.java:53)
at org.apache.lucene.util.AbstractBeforeAfterRule$1.evaluate(AbstractBeforeAfterRule.java:45)
at org.apache.lucene.util.TestRuleStoreClassName$1.evaluate(TestRuleStoreClassName.java:42)
at com.carrotsearch.randomizedtesting.rules.SystemPropertiesInvariantRule$1.evaluate(SystemPropertiesInvariantRule.java:55)
at com.carrotsearch.randomizedtesting.rules.NoShadowingOrOverridesOnMethodsRule$1.evaluate(NoShadowingOrOverridesOnMethodsRule.java:39)
at com.carrotsearch.randomizedtesting.rules.NoShadowingOrOverridesOnMethodsRule$1.evaluate(NoShadowingOrOverridesOnMethodsRule.java:39)
at com.carrotsearch.randomizedtesting.rules.StatementAdapter.evaluate(StatementAdapter.java:36)
at org.apache.lucene.util.TestRuleAssertionsRequired$1.evaluate(TestRuleAssertionsRequired.java:43)
at org.apache.lucene.util.TestRuleMarkFailure$1.evaluate(TestRuleMarkFailure.java:48)
at org.apache.lucene.util.TestRuleIgnoreAfterMaxFailures$1.evaluate(TestRuleIgnoreAfterMaxFailures.java:70)
at org.apache.lucene.util.TestRuleIgnoreTestSuites$1.evaluate(TestRuleIgnoreTestSuites.java:55)
at com.carrotsearch.randomizedtesting.rules.StatementAdapter.evaluate(StatementAdapter.java:36)
at com.carrotsearch.randomizedtesting.ThreadLeakControl$StatementRunner.run(ThreadLeakControl.java:358)
at java.lang.Thread.run(Thread.java:722)
Caused by: java.lang.RuntimeException: REQUEST FAILED: xpath=*[count(//doc)=0]
xml response was: <?xml version="1.0" encoding="UTF-8"?>
<response>
<lst name="responseHeader"><int name="status">0</int><int name="QTime">10</int></lst><result name="response" numFound="3" start="0"><doc><str name="id">5</str></doc><doc><str name="id">6</str></doc><doc><str name="id">7</str></doc></result>
</response>

request was:fl=id&q=*:*&fq={!field+f%3Dstqpt_geohash+score%3Dnone}Intersects(Circle(0,0+d%3D0.8993203677616635))&rows=1000
at org.apache.solr.SolrTestCaseJ4.assertQ(SolrTestCaseJ4.java:496)
... 44 more


REGRESSION: org.apache.solr.search.TestSolr4Spatial.checkQueryEmptyIndex {p0=twodoubles}

Error Message:
Exception during query

Stack Trace:
java.lang.RuntimeException: Exception during query
at __randomizedtesting.SeedInfo.seed([A43ACD08EAE49210:A4F046E521861550]:0)
at org.apache.solr.SolrTestCaseJ4.assertQ(SolrTestCaseJ4.java:503)
at org.apache.solr.SolrTestCaseJ4.assertQ(SolrTestCaseJ4.java:470)
at org.apache.solr.search.TestSolr4Spatial.checkHits(TestSolr4Spatial.java:170)
at org.apache.solr.search.TestSolr4Spatial.checkHits(TestSolr4Spatial.java:139)
at org.apache.solr.search.TestSolr4Spatial.checkQueryEmptyIndex(TestSolr4Spatial.java:135)
at sun.reflect.NativeMethodAccessorImpl.invoke0(Native Method)
at sun.reflect.NativeMethodAccessorImpl.invoke(NativeMethodAccessorImpl.java:57)
at sun.reflect.DelegatingMethodAccessorImpl.invoke(DelegatingMethodAccessorImpl.java:43)
at java.lang.reflect.Method.invoke(Method.java:601)
at com.carrotsearch.randomizedtesting.RandomizedRunner.invoke(RandomizedRunner.java:1559)
at com.carrotsearch.randomizedtesting.RandomizedRunner.access$600(RandomizedRunner.java:79)
at com.carrotsearch.randomizedtesting.RandomizedRunner$6.evaluate(RandomizedRunner.java:737)
at com.carrotsearch.randomizedtesting.RandomizedRunner$7.evaluate(RandomizedRunner.java:773)
at com.carrotsearch.randomizedtesting.RandomizedRunner$8.evaluate(RandomizedRunner.java:787)
at com.carrotsearch.randomizedtesting.rules.SystemPropertiesRestoreRule$1.evaluate(SystemPropertiesRestoreRule.java:53)
at org.apache.lucene.util.TestRuleSetupTeardownChained$1.evaluate(TestRuleSetupTeardownChained.java:50)
at org.apache.lucene.util.TestRuleFieldCacheSanity$1.evaluate(TestRuleFieldCacheSanity.java:51)
at org.apache.lucene.util.AbstractBeforeAfterRule$1.evaluate(AbstractBeforeAfterRule.java:45)
at com.carrotsearch.randomizedtesting.rules.SystemPropertiesInvariantRule$1.evaluate(SystemPropertiesInvariantRule.java:55)
at org.apache.lucene.util.TestRuleThreadAndTestName$1.evaluate(TestRuleThreadAndTestName.java:48)
at org.apache.lucene.util.TestRuleIgnoreAfterMaxFailures$1.evaluate(TestRuleIgnoreAfterMaxFailures.java:70)
at org.apache.lucene.util.TestRuleMarkFailure$1.evaluate(TestRuleMarkFailure.java:48)
at com.carrotsearch.randomizedtesting.rules.StatementAdapter.evaluate(StatementAdapter.java:36)
at com.carrotsearch.randomizedtesting.ThreadLeakControl$StatementRunner.run(ThreadLeakControl.java:358)
at com.carrotsearch.randomizedtesting.ThreadLeakControl.forkTimeoutingTask(ThreadLeakControl.java:782)
at com.carrotsearch.randomizedtesting.ThreadLeakControl$3.evaluate(ThreadLeakControl.java:442)
at com.carrotsearch.randomizedtesting.RandomizedRunner.runSingleTest(RandomizedRunner.java:746)
at com.carrotsearch.randomizedtesting.RandomizedRunner$3.evaluate(RandomizedRunner.java:648)
at com.carrotsearch.randomizedtesting.RandomizedRunner$4.evaluate(RandomizedRunner.java:682)
at com.carrotsearch.randomizedtesting.RandomizedRunner$5.evaluate(RandomizedRunner.java:693)
at com.carrotsearch.randomizedtesting.rules.StatementAdapter.evaluate(StatementAdapter.java:36)
at com.carrotsearch.randomizedtesting.rules.SystemPropertiesRestoreRule$1.evaluate(SystemPropertiesRestoreRule.java:53)
at org.apache.lucene.util.AbstractBeforeAfterRule$1.evaluate(AbstractBeforeAfterRule.java:45)
at org.apache.lucene.util.TestRuleStoreClassName$1.evaluate(TestRuleStoreClassName.java:42)
at com.carrotsearch.randomizedtesting.rules.SystemPropertiesInvariantRule$1.evaluate(SystemPropertiesInvariantRule.java:55)
at com.carrotsearch.randomizedtesting.rules.NoShadowingOrOverridesOnMethodsRule$1.evaluate(NoShadowingOrOverridesOnMethodsRule.java:39)
at com.carrotsearch.randomizedtesting.rules.NoShadowingOrOverridesOnMethodsRule$1.evaluate(NoShadowingOrOverridesOnMethodsRule.java:39)
at com.carrotsearch.randomizedtesting.rules.StatementAdapter.evaluate(StatementAdapter.java:36)
at org.apache.lucene.util.TestRuleAssertionsRequired$1.evaluate(TestRuleAssertionsRequired.java:43)
at org.apache.lucene.util.TestRuleMarkFailure$1.evaluate(TestRuleMarkFailure.java:48)
at org.apache.lucene.util.TestRuleIgnoreAfterMaxFailures$1.evaluate(TestRuleIgnoreAfterMaxFailures.java:70)
at org.apache.lucene.util.TestRuleIgnoreTestSuites$1.evaluate(TestRuleIgnoreTestSuites.java:55)
at com.carrotsearch.randomizedtesting.rules.StatementAdapter.evaluate(StatementAdapter.java:36)
at com.carrotsearch.randomizedtesting.ThreadLeakControl$StatementRunner.run(ThreadLeakControl.java:358)
at java.lang.Thread.run(Thread.java:722)
Caused by: java.lang.RuntimeException: REQUEST FAILED: xpath=*[count(//doc)=0]
xml response was: <?xml version="1.0" encoding="UTF-8"?>
<response>
<lst name="responseHeader"><int name="status">0</int><int name="QTime">1</int></lst><result name="response" numFound="3" start="0"><doc><str name="id">5</str></doc><doc><str name="id">6</str></doc><doc><str name="id">7</str></doc></result>
</response>

request was:fl=id&q=*:*&fq={!field+f%3Dtwodoubles+score%3Dnone}Intersects(Circle(0,0+d%3D0.8993203677616635))&rows=1000
at org.apache.solr.SolrTestCaseJ4.assertQ(SolrTestCaseJ4.java:496)
... 44 more




Build Log:
[...truncated 8320 lines...]
[junit4:junit4] Suite: org.apache.solr.search.TestSolr4Spatial
[junit4:junit4] 2> 0 T2572 oas.SolrTestCaseJ4.initCore ####initCore
[junit4:junit4] 2> Creating dataDir: /mnt/ssd/jenkins/workspace/Lucene-Solr-trunk-Linux/solr/build/solr-core/test/J1/./solrtest-TestSolr4Spatial-1347858753620
[junit4:junit4] 2> 1 T2572 oasc.SolrResourceLoader.<init> new SolrResourceLoader for directory: '/mnt/ssd/jenkins/workspace/Lucene-Solr-trunk-Linux/solr/build/solr-core/test-files/solr/collection1/'
[junit4:junit4] 2> 1 T2572 oasc.SolrResourceLoader.replaceClassLoader Adding 'file:/mnt/ssd/jenkins/workspace/Lucene-Solr-trunk-Linux/solr/build/solr-core/test-files/solr/collection1/lib/README' to classloader
[junit4:junit4] 2> 1 T2572 oasc.SolrResourceLoader.replaceClassLoader Adding 'file:/mnt/ssd/jenkins/workspace/Lucene-Solr-trunk-Linux/solr/build/solr-core/test-files/solr/collection1/lib/classes/' to classloader
[junit4:junit4] 2> 31 T2572 oasc.SolrConfig.<init> Using Lucene MatchVersion: LUCENE_50
[junit4:junit4] 2> 70 T2572 oasc.SolrConfig.<init> Loaded SolrConfig: solrconfig-basic.xml
[junit4:junit4] 2> 71 T2572 oass.IndexSchema.readSchema Reading Solr Schema
[junit4:junit4] 2> 74 T2572 oass.IndexSchema.readSchema Schema name=test
[junit4:junit4] 2> 170 T2572 oass.IndexSchema.readSchema unique key field: id
[junit4:junit4] 2> 183 T2572 oasc.SolrResourceLoader.locateSolrHome JNDI not configured for solr (NoInitialContextEx)
[junit4:junit4] 2> 184 T2572 oasc.SolrResourceLoader.locateSolrHome using system property solr.solr.home: /mnt/ssd/jenkins/workspace/Lucene-Solr-trunk-Linux/solr/build/solr-core/test-files/solr
[junit4:junit4] 2> 184 T2572 oasc.SolrResourceLoader.<init> new SolrResourceLoader for directory: '/mnt/ssd/jenkins/workspace/Lucene-Solr-trunk-Linux/solr/build/solr-core/test-files/solr/'
[junit4:junit4] 2> 196 T2572 oasc.CoreContainer.<init> New CoreContainer 726671478
[junit4:junit4] 2> 197 T2572 oasc.SolrCore.<init> [collection1] Opening new SolrCore at /mnt/ssd/jenkins/workspace/Lucene-Solr-trunk-Linux/solr/build/solr-core/test-files/solr/collection1/, dataDir=/mnt/ssd/jenkins/workspace/Lucene-Solr-trunk-Linux/solr/build/solr-core/test/J1/./solrtest-TestSolr4Spatial-1347858753620/
[junit4:junit4] 2> 197 T2572 oasc.SolrCore.<init> JMX monitoring not detected for core: collection1
[junit4:junit4] 2> 198 T2572 oasc.SolrCore.getNewIndexDir WARNING New index directory detected: old=null new=/mnt/ssd/jenkins/workspace/Lucene-Solr-trunk-Linux/solr/build/solr-core/test/J1/./solrtest-TestSolr4Spatial-1347858753620/index/
[junit4:junit4] 2> 198 T2572 oasc.SolrCore.initIndex WARNING [collection1] Solr index directory '/mnt/ssd/jenkins/workspace/Lucene-Solr-trunk-Linux/solr/build/solr-core/test/J1/./solrtest-TestSolr4Spatial-1347858753620/index' doesn't exist. Creating new index...
[junit4:junit4] 2> 199 T2572 oasc.CachingDirectoryFactory.get return new directory for /mnt/ssd/jenkins/workspace/Lucene-Solr-trunk-Linux/solr/build/solr-core/test/J1/./solrtest-TestSolr4Spatial-1347858753620/index forceNew:false
[junit4:junit4] 2> 200 T2572 oasc.SolrDeletionPolicy.onCommit SolrDeletionPolicy.onCommit: commits:num=1
[junit4:junit4] 2> commit{dir=MockDirWrapper(org.apache.lucene.store.RAMDirectory [at] 1983393 lockFactory=org.apache.lucene.store.NativeFSLockFactory [at] 21cf0b6),segFN=segments_1,generation=1,filenames=[segments_1]
[junit4:junit4] 2> 201 T2572 oasc.SolrDeletionPolicy.updateCommits newest commit = 1
[junit4:junit4] 2> 201 T2572 oasc.RequestHandlers.initHandlersFromConfig created standard: solr.StandardRequestHandler
[junit4:junit4] 2> 203 T2572 oass.SolrIndexSearcher.<init> Opening Searcher [at] 1cf5e5e main
[junit4:junit4] 2> 203 T2572 oass.SolrIndexSearcher.getIndexDir WARNING WARNING: Directory impl does not support setting indexDir: org.apache.lucene.store.MockDirectoryWrapper
[junit4:junit4] 2> 204 T2572 oasu.CommitTracker.<init> Hard AutoCommit: disabled
[junit4:junit4] 2> 204 T2572 oasu.CommitTracker.<init> Soft AutoCommit: disabled
[junit4:junit4] 2> 204 T2572 oashc.HttpShardHandlerFactory.getParameter Setting socketTimeout to: 0
[junit4:junit4] 2> 205 T2572 oashc.HttpShardHandlerFactory.getParameter Setting urlScheme to: http://
[junit4:junit4] 2> 205 T2572 oashc.HttpShardHandlerFactory.getParameter Setting connTimeout to: 0
[junit4:junit4] 2> 205 T2572 oashc.HttpShardHandlerFactory.getParameter Setting maxConnectionsPerHost to: 20
[junit4:junit4] 2> 205 T2572 oashc.HttpShardHandlerFactory.getParameter Setting corePoolSize to: 0
[junit4:junit4] 2> 206 T2572 oashc.HttpShardHandlerFactory.getParameter Setting maximumPoolSize to: 2147483647
[junit4:junit4] 2> 206 T2572 oashc.HttpShardHandlerFactory.getParameter Setting maxThreadIdleTime to: 5
[junit4:junit4] 2> 206 T2572 oashc.HttpShardHandlerFactory.getParameter Setting sizeOfQueue to: -1
[junit4:junit4] 2> 206 T2572 oashc.HttpShardHandlerFactory.getParameter Setting fairnessPolicy to: false
[junit4:junit4] 2> 206 T2572 oascsi.HttpClientUtil.createClient Creating new http client, config:maxConnectionsPerHost=20&maxConnections=10000&socketTimeout=0&connTimeout=0&retry=false
[junit4:junit4] 2> 209 T2573 oasc.SolrCore.registerSearcher [collection1] Registered new searcher Searcher [at] 1cf5e5e main{StandardDirectoryReader(segments_1:1)}
[junit4:junit4] 2> 209 T2572 oasc.CoreContainer.register registering core: collection1
[junit4:junit4] 2> 210 T2572 oas.SolrTestCaseJ4.initCore ####initCore end
[junit4:junit4] 2> 212 T2572 oas.SolrTestCaseJ4.setUp ###Starting testSortMultiVal {p0=srpt_geohash}
[junit4:junit4] 2> ASYNC NEW_CORE C190 name=collection1 org.apache.solr.core.SolrCore [at] 69b83d2
[junit4:junit4] 2> 214 T2572 C190 oasu.DirectUpdateHandler2.deleteAll [collection1] REMOVING ALL DOCUMENTS FROM INDEX
[junit4:junit4] 2> 215 T2572 C190 oasc.SolrDeletionPolicy.onInit SolrDeletionPolicy.onInit: commits:num=1
[junit4:junit4] 2> commit{dir=MockDirWrapper(org.apache.lucene.store.RAMDirectory [at] 1983393 lockFactory=org.apache.lucene.store.NativeFSLockFactory [at] 21cf0b6),segFN=segments_1,generation=1,filenames=[segments_1]
[junit4:junit4] 2> 216 T2572 C190 oasc.SolrDeletionPolicy.updateCommits newest commit = 1
[junit4:junit4] 2> 216 T2572 C190 UPDATE [collection1] webapp=null path=null params={} {deleteByQuery=*:*} 0 2
[junit4:junit4] 2> 231 T2572 C190 oass.AbstractSpatialPrefixTreeFieldType.newSpatialStrategy srpt_geohash{class=org.apache.solr.schema.SpatialRecursivePrefixTreeFieldType,analyzer=org.apache.solr.schema.FieldType$DefaultAnalyzer,args={prefixTree=geohash}} strat: RecursivePrefixTreeStrategy(prefixGridScanLevel:7,SPG:(GeohashPrefixTree(maxLevels:11,ctx:SpatialContext{geo=true, calculator=Haversine, worldBounds=Rect(minX=-180.0,maxX=180.0,minY=-90.0,maxY=90.0)}))) maxLevels: 11
[junit4:junit4] 2> 235 T2572 C190 UPDATE [collection1] webapp=null path=null params={} {add=[100]} 0 14
[junit4:junit4] 2> 238 T2572 C190 UPDATE [collection1] webapp=null path=null params={} {add=[101]} 0 1
[junit4:junit4] 2> 240 T2572 C190 oasu.DirectUpdateHandler2.commit start commit{flags=0,_version_=0,optimize=false,openSearcher=true,waitSearcher=true,expungeDeletes=false,softCommit=false}
[junit4:junit4] 2> 241 T2572 C190 oasc.SolrDeletionPolicy.onCommit SolrDeletionPolicy.onCommit: commits:num=2
[junit4:junit4] 2> commit{dir=MockDirWrapper(org.apache.lucene.store.RAMDirectory [at] 1983393 lockFactory=org.apache.lucene.store.NativeFSLockFactory [at] 21cf0b6),segFN=segments_1,generation=1,filenames=[segments_1]
[junit4:junit4] 2> commit{dir=MockDirWrapper(org.apache.lucene.store.RAMDirectory [at] 1983393 lockFactory=org.apache.lucene.store.NativeFSLockFactory [at] 21cf0b6),segFN=segments_2,generation=2,filenames=[._0.fnm, _0_MockVariableIntBlock_0.tib, _0_MockVariableIntBlock_0.doc, _0_nrm.cfe, segments_2, _0.fdx, _0_MockVariableIntBlock_0.skp, _0_nrm.cfs, _0.si, _0.fdt, _0_MockVariableIntBlock_0.tii]
[junit4:junit4] 2> 241 T2572 C190 oasc.SolrDeletionPolicy.updateCommits newest commit = 2
[junit4:junit4] 2> 242 T2572 C190 oass.SolrIndexSearcher.<init> Opening Searcher [at] 28552da main
[junit4:junit4] 2> 243 T2572 C190 oass.SolrIndexSearcher.getIndexDir WARNING WARNING: Directory impl does not support setting indexDir: org.apache.lucene.store.MockDirectoryWrapper
[junit4:junit4] 2> 243 T2573 oasc.SolrCore.registerSearcher [collection1] Registered new searcher Searcher [at] 28552da main{StandardDirectoryReader(segments_2:4 _0(5.0):C2)}
[junit4:junit4] 2> 243 T2572 C190 oasu.DirectUpdateHandler2.commit end_commit_flush
[junit4:junit4] 2> 244 T2572 C190 UPDATE [collection1] webapp=null path=null params={} {commit=} 0 4
[junit4:junit4] 2> 255 T2572 C190 REQ [collection1] webapp=null path=null params={sort=score+asc&fl=id,score&q={!+score%3Ddistance}srpt_geohash:"Intersects(Circle(3,4+d%3D9))"} hits=2 status=0 QTime=10
[junit4:junit4] 2> 255 T2572 oas.SolrTestCaseJ4.tearDown ###Ending testSortMultiVal {p0=srpt_geohash}
[junit4:junit4] 2> 258 T2572 oas.SolrTestCaseJ4.setUp ###Starting checkResultFormat {p0=srpt_geohash}
[junit4:junit4] 2> 260 T2572 C190 oasu.DirectUpdateHandler2.deleteAll [collection1] REMOVING ALL DOCUMENTS FROM INDEX
[junit4:junit4] 2> 261 T2572 C190 UPDATE [collection1] webapp=null path=null params={} {deleteByQuery=*:*} 0 1
[junit4:junit4] 2> 263 T2572 C190 UPDATE [collection1] webapp=null path=null params={} {add=[11]} 0 0
[junit4:junit4] 2> 266 T2572 C190 oasu.DirectUpdateHandler2.commit start commit{flags=0,_version_=0,optimize=false,openSearcher=true,waitSearcher=true,expungeDeletes=false,softCommit=false}
[junit4:junit4] 2> 267 T2572 C190 oasc.SolrDeletionPolicy.onCommit SolrDeletionPolicy.onCommit: commits:num=2
[junit4:junit4] 2> commit{dir=MockDirWrapper(org.apache.lucene.store.RAMDirectory [at] 1983393 lockFactory=org.apache.lucene.store.NativeFSLockFactory [at] 21cf0b6),segFN=segments_2,generation=2,filenames=[._0.fnm, _0_MockVariableIntBlock_0.tib, _0_MockVariableIntBlock_0.doc, _0_nrm.cfe, segments_2, _0.fdx, _0_MockVariableIntBlock_0.skp, _0_nrm.cfs, _0.si, _0.fdt, _0_MockVariableIntBlock_0.tii]
[junit4:junit4] 2> commit{dir=MockDirWrapper(org.apache.lucene.store.RAMDirectory [at] 1983393 lockFactory=org.apache.lucene.store.NativeFSLockFactory [at] 21cf0b6),segFN=segments_3,generation=3,filenames=[._1_MockVariableIntBlock_0.skp, _1.fdx, _1_nrm.cfs, _1.fdt, _1_MockVariableIntBlock_0.tii, _1.si, _1_MockVariableIntBlock_0.doc, _1.fnm, segments_3, _1_MockVariableIntBlock_0.tib, _1_nrm.cfe]
[junit4:junit4] 2> 267 T2572 C190 oasc.SolrDeletionPolicy.updateCommits newest commit = 3
[junit4:junit4] 2> 268 T2572 C190 oass.SolrIndexSearcher.<init> Opening Searcher [at] 306e692 main
[junit4:junit4] 2> 268 T2572 C190 oass.SolrIndexSearcher.getIndexDir WARNING WARNING: Directory impl does not support setting indexDir: org.apache.lucene.store.MockDirectoryWrapper
[junit4:junit4] 2> 269 T2573 oasc.SolrCore.registerSearcher [collection1] Registered new searcher Searcher [at] 306e692 main{StandardDirectoryReader(segments_3:7 _1(5.0):C1)}
[junit4:junit4] 2> 269 T2572 C190 oasu.DirectUpdateHandler2.commit end_commit_flush
[junit4:junit4] 2> 269 T2572 C190 UPDATE [collection1] webapp=null path=null params={} {commit=} 0 3
[junit4:junit4] 2> 271 T2572 C190 REQ [collection1] webapp=null path=null params={fl=id,srpt_geohash&q=*:*&fq={!field+needScore%3Dfalse+f%3Dsrpt_geohash}Intersects(Circle(89.9,-130+d%3D9))&rows=1000} hits=1 status=0 QTime=0
[junit4:junit4] 2> 273 T2572 oas.SolrTestCaseJ4.tearDown ###Ending checkResultFormat {p0=srpt_geohash}
[junit4:junit4] 2> 275 T2572 oas.SolrTestCaseJ4.setUp ###Starting testRangeSyntax {p0=srpt_geohash}
[junit4:junit4] 2> 277 T2572 C190 oasu.DirectUpdateHandler2.deleteAll [collection1] REMOVING ALL DOCUMENTS FROM INDEX
[junit4:junit4] 2> 278 T2572 C190 UPDATE [collection1] webapp=null path=null params={} {deleteByQuery=*:*} 0 1
[junit4:junit4] 2> 280 T2572 C190 UPDATE [collection1] webapp=null path=null params={} {add=[1]} 0 0
[junit4:junit4] 2> 283 T2572 C190 UPDATE [collection1] webapp=null path=null params={} {add=[2]} 0 0
[junit4:junit4] 2> 285 T2572 C190 UPDATE [collection1] webapp=null path=null params={} {add=[3]} 0 0
[junit4:junit4] 2> 288 T2572 C190 UPDATE [collection1] webapp=null path=null params={} {add=[4]} 0 0
[junit4:junit4] 2> 290 T2572 C190 UPDATE [collection1] webapp=null path=null params={} {add=[5]} 0 0
[junit4:junit4] 2> 293 T2572 C190 UPDATE [collection1] webapp=null path=null params={} {add=[6]} 0 0
[junit4:junit4] 2> 301 T2572 C190 UPDATE [collection1] webapp=null path=null params={} {add=[7]} 0 0
[junit4:junit4] 2> 304 T2572 C190 UPDATE [collection1] webapp=null path=null params={} {add=[8]} 0 0
[junit4:junit4] 2> 307 T2572 C190 UPDATE [collection1] webapp=null path=null params={} {add=[9]} 0 1
[junit4:junit4] 2> 309 T2572 C190 UPDATE [collection1] webapp=null path=null params={} {add=[10]} 0 0
[junit4:junit4] 2> 312 T2572 C190 UPDATE [collection1] webapp=null path=null params={} {add=[11]} 0 1
[junit4:junit4] 2> 314 T2572 C190 UPDATE [collection1] webapp=null path=null params={} {add=[12]} 0 0
[junit4:junit4] 2> 317 T2572 C190 UPDATE [collection1] webapp=null path=null params={} {add=[13]} 0 1
[junit4:junit4] 2> 319 T2572 C190 oasu.DirectUpdateHandler2.commit start commit{flags=0,_version_=0,optimize=false,openSearcher=true,waitSearcher=true,expungeDeletes=false,softCommit=false}
[junit4:junit4] 2> 320 T2572 C190 oasc.SolrDeletionPolicy.onCommit SolrDeletionPolicy.onCommit: commits:num=2
[junit4:junit4] 2> commit{dir=MockDirWrapper(org.apache.lucene.store.RAMDirectory [at] 1983393 lockFactory=org.apache.lucene.store.NativeFSLockFactory [at] 21cf0b6),segFN=segments_3,generation=3,filenames=[._1_MockVariableIntBlock_0.skp, _1.fdx, _1_nrm.cfs, _1.fdt, _1_MockVariableIntBlock_0.tii, _1.si, _1_MockVariableIntBlock_0.doc, _1.fnm, segments_3, _1_MockVariableIntBlock_0.tib, _1_nrm.cfe]
[junit4:junit4] 2> commit{dir=MockDirWrapper(org.apache.lucene.store.RAMDirectory [at] 1983393 lockFactory=org.apache.lucene.store.NativeFSLockFactory [at] 21cf0b6),segFN=segments_4,generation=4,filenames=[._2.si, _2_MockVariableIntBlock_0.tii, _2_nrm.cfe, _2_MockVariableIntBlock_0.tib, _2.fdt, _2_MockVariableIntBlock_0.skp, _2_nrm.cfs, _2.fdx, _2_MockVariableIntBlock_0.doc, _2.fnm, segments_4]
[junit4:junit4] 2> 321 T2572 C190 oasc.SolrDeletionPolicy.updateCommits newest commit = 4
[junit4:junit4] 2> 321 T2572 C190 oass.SolrIndexSearcher.<init> Opening Searcher [at] 761bd1b main
[junit4:junit4] 2> 322 T2572 C190 oass.SolrIndexSearcher.getIndexDir WARNING WARNING: Directory impl does not support setting indexDir: org.apache.lucene.store.MockDirectoryWrapper
[junit4:junit4] 2> 322 T2573 oasc.SolrCore.registerSearcher [collection1] Registered new searcher Searcher [at] 761bd1b main{StandardDirectoryReader(segments_4:10 _2(5.0):C13)}
[junit4:junit4] 2> 322 T2572 C190 oasu.DirectUpdateHandler2.commit end_commit_flush
[junit4:junit4] 2> 323 T2572 C190 UPDATE [collection1] webapp=null path=null params={} {commit=} 0 4
[junit4:junit4] 2> 325 T2572 C190 REQ [collection1] webapp=null path=null params={fl=id&q=*:*&fq={!+needScore%3Dtrue+df%3Dsrpt_geohash}[32,-80+TO+33,-79]&rows=1000} hits=1 status=0 QTime=1
[junit4:junit4] 2> 327 T2572 oas.SolrTestCaseJ4.tearDown ###Ending testRangeSyntax {p0=srpt_geohash}
[junit4:junit4] 2> 330 T2572 oas.SolrTestCaseJ4.setUp ###Starting checkQueryEmptyIndex {p0=srpt_geohash}
[junit4:junit4] 2> 331 T2572 C190 oasu.DirectUpdateHandler2.deleteAll [collection1] REMOVING ALL DOCUMENTS FROM INDEX
[junit4:junit4] 2> 332 T2572 C190 UPDATE [collection1] webapp=null path=null params={} {deleteByQuery=*:*} 0 1
[junit4:junit4] 2> 335 T2572 C190 REQ [collection1] webapp=null path=null params={fl=id&q=*:*&fq={!field+f%3Dsrpt_geohash+score%3Dnone}Intersects(Circle(0,0+d%3D0.8993203677616635))&rows=1000} hits=3 status=0 QTime=2
[junit4:junit4] 2> 336 T2572 oas.SolrTestCaseJ4.assertQ SEVERE REQUEST FAILED: xpath=*[count(//doc)=0]
[junit4:junit4] 2> xml response was: <?xml version="1.0" encoding="UTF-8"?>
[junit4:junit4] 2> <response>
[junit4:junit4] 2> <lst name="responseHeader"><int name="status">0</int><int name="QTime">2</int></lst><result name="response" numFound="3" start="0"><doc><str name="id">5</str></doc><doc><str name="id">6</str></doc><doc><str name="id">7</str></doc></result>
[junit4:junit4] 2> </response>
[junit4:junit4] 2>
[junit4:junit4] 2> request was:fl=id&q=*:*&fq={!field+f%3Dsrpt_geohash+score%3Dnone}Intersects(Circle(0,0+d%3D0.8993203677616635))&rows=1000
[junit4:junit4] 2> 337 T2572 oasc.SolrException.log SEVERE REQUEST FAILED: fl=id&q=*:*&fq={!field+f%3Dsrpt_geohash+score%3Dnone}Intersects(Circle(0,0+d%3D0.8993203677616635))&rows=1000:java.lang.RuntimeException: REQUEST FAILED: xpath=*[count(//doc)=0]
[junit4:junit4] 2> xml response was: <?xml version="1.0" encoding="UTF-8"?>
[junit4:junit4] 2> <response>
[junit4:junit4] 2> <lst name="responseHeader"><int name="status">0</int><int name="QTime">2</int></lst><result name="response" numFound="3" start="0"><doc><str name="id">5</str></doc><doc><str name="id">6</str></doc><doc><str name="id">7</str></doc></result>
[junit4:junit4] 2> </response>
[junit4:junit4] 2>
[junit4:junit4] 2> request was:fl=id&q=*:*&fq={!field+f%3Dsrpt_geohash+score%3Dnone}Intersects(Circle(0,0+d%3D0.8993203677616635))&rows=1000
[junit4:junit4] 2> at org.apache.solr.SolrTestCaseJ4.assertQ(SolrTestCaseJ4.java:496)
[junit4:junit4] 2> at org.apache.solr.SolrTestCaseJ4.assertQ(SolrTestCaseJ4.java:470)
[junit4:junit4] 2> at org.apache.solr.search.TestSolr4Spatial.checkHits(TestSolr4Spatial.java:170)
[junit4:junit4] 2> at org.apache.solr.search.TestSolr4Spatial.checkHits(TestSolr4Spatial.java:139)
[junit4:junit4] 2> at org.apache.solr.search.TestSolr4Spatial.checkQueryEmptyIndex(TestSolr4Spatial.java:135)
[junit4:junit4] 2> at sun.reflect.NativeMethodAccessorImpl.invoke0(Native Method)
[junit4:junit4] 2> at sun.reflect.NativeMethodAccessorImpl.invoke(NativeMethodAccessorImpl.java:57)
[junit4:junit4] 2> at sun.reflect.DelegatingMethodAccessorImpl.invoke(DelegatingMethodAccessorImpl.java:43)
[junit4:junit4] 2> at java.lang.reflect.Method.invoke(Method.java:601)
[junit4:junit4] 2> at com.carrotsearch.randomizedtesting.RandomizedRunner.invoke(RandomizedRunner.java:1559)
[junit4:junit4] 2> at com.carrotsearch.randomizedtesting.RandomizedRunner.access$600(RandomizedRunner.java:79)
[junit4:junit4] 2> at com.carrotsearch.randomizedtesting.RandomizedRunner$6.evaluate(RandomizedRunner.java:737)
[junit4:junit4] 2> at com.carrotsearch.randomizedtesting.RandomizedRunner$7.evaluate(RandomizedRunner.java:773)
[junit4:junit4] 2> at com.carrotsearch.randomizedtesting.RandomizedRunner$8.evaluate(RandomizedRunner.java:787)
[junit4:junit4] 2> at com.carrotsearch.randomizedtesting.rules.SystemPropertiesRestoreRule$1.evaluate(SystemPropertiesRestoreRule.java:53)
[junit4:junit4] 2> at org.apache.lucene.util.TestRuleSetupTeardownChained$1.evaluate(TestRuleSetupTeardownChained.java:50)
[junit4:junit4] 2> at org.apache.lucene.util.TestRuleFieldCacheSanity$1.evaluate(TestRuleFieldCacheSanity.java:51)
[junit4:junit4] 2> at org.apache.lucene.util.AbstractBeforeAfterRule$1.evaluate(AbstractBeforeAfterRule.java:45)
[junit4:junit4] 2> at com.carrotsearch.randomizedtesting.rules.SystemPropertiesInvariantRule$1.evaluate(SystemPropertiesInvariantRule.java:55)
[junit4:junit4] 2> at org.apache.lucene.util.TestRuleThreadAndTestName$1.evaluate(TestRuleThreadAndTestName.java:48)
[junit4:junit4] 2> at org.apache.lucene.util.TestRuleIgnoreAfterMaxFailures$1.evaluate(TestRuleIgnoreAfterMaxFailures.java:70)
[junit4:junit4] 2> at org.apache.lucene.util.TestRuleMarkFailure$1.evaluate(TestRuleMarkFailure.java:48)
[junit4:junit4] 2> at com.carrotsearch.randomizedtesting.rules.StatementAdapter.evaluate(StatementAdapter.java:36)
[junit4:junit4] 2> at com.carrotsearch.randomizedtesting.ThreadLeakControl$StatementRunner.run(ThreadLeakControl.java:358)
[junit4:junit4] 2> at com.carrotsearch.randomizedtesting.ThreadLeakControl.forkTimeoutingTask(ThreadLeakControl.java:782)
[junit4:junit4] 2> at com.carrotsearch.randomizedtesting.ThreadLeakControl$3.evaluate(ThreadLeakControl.java:442)
[junit4:junit4] 2> at com.carrotsearch.randomizedtesting.RandomizedRunner.runSingleTest(RandomizedRunner.java:746)
[junit4:junit4] 2> at com.carrotsearch.randomizedtesting.RandomizedRunner$3.evaluate(RandomizedRunner.java:648)
[junit4:junit4] 2> at com.carrotsearch.randomizedtesting.RandomizedRunner$4.evaluate(RandomizedRunner.java:682)
[junit4:junit4] 2> at com.carrotsearch.randomizedtesting.RandomizedRunner$5.evaluate(RandomizedRunner.java:693)
[junit4:junit4] 2> at com.carrotsearch.randomizedtesting.rules.StatementAdapter.evaluate(StatementAdapter.java:36)
[junit4:junit4] 2> at com.carrotsearch.randomizedtesting.rules.SystemPropertiesRestoreRule$1.evaluate(SystemPropertiesRestoreRule.java:53)
[junit4:junit4] 2> at org.apache.lucene.util.AbstractBeforeAfterRule$1.evaluate(AbstractBeforeAfterRule.java:45)
[junit4:junit4] 2> at org.apache.lucene.util.TestRuleStoreClassName$1.evaluate(TestRuleStoreClassName.java:42)
[junit4:junit4] 2> at com.carrotsearch.randomizedtesting.rules.SystemPropertiesInvariantRule$1.evaluate(SystemPropertiesInvariantRule.java:55)
[junit4:junit4] 2> at com.carrotsearch.randomizedtesting.rules.NoShadowingOrOverridesOnMethodsRule$1.evaluate(NoShadowingOrOverridesOnMethodsRule.java:39)
[junit4:junit4] 2> at com.carrotsearch.randomizedtesting.rules.NoShadowingOrOverridesOnMethodsRule$1.evaluate(NoShadowingOrOverridesOnMethodsRule.java:39)
[junit4:junit4] 2> at com.carrotsearch.randomizedtesting.rules.StatementAdapter.evaluate(StatementAdapter.java:36)
[junit4:junit4] 2> at org.apache.lucene.util.TestRuleAssertionsRequired$1.evaluate(TestRuleAssertionsRequired.java:43)
[junit4:junit4] 2> at org.apache.lucene.util.TestRuleMarkFailure$1.evaluate(TestRuleMarkFailure.java:48)
[junit4:junit4] 2> at org.apache.lucene.util.TestRuleIgnoreAfterMaxFailures$1.evaluate(TestRuleIgnoreAfterMaxFailures.java:70)
[junit4:junit4] 2> at org.apache.lucene.util.TestRuleIgnoreTestSuites$1.evaluate(TestRuleIgnoreTestSuites.java:55)
[junit4:junit4] 2> at com.carrotsearch.randomizedtesting.rules.StatementAdapter.evaluate(StatementAdapter.java:36)
[junit4:junit4] 2> at com.carrotsearch.randomizedtesting.ThreadLeakControl$StatementRunner.run(ThreadLeakControl.java:358)
[junit4:junit4] 2> at java.lang.Thread.run(Thread.java:722)
[junit4:junit4] 2>
[junit4:junit4] 2> 337 T2572 oas.SolrTestCaseJ4.tearDown ###Ending checkQueryEmptyIndex {p0=srpt_geohash}
[junit4:junit4] 2> NOTE: reproduce with: ant test -Dtestcase=TestSolr4Spatial -Dtests.method="checkQueryEmptyIndex {p0=srpt_geohash}" -Dtests.seed=A43ACD08EAE49210 -Dtests.multiplier=3 -Dtests.slow=true -Dtests.locale=es_CR -Dtests.timezone=Africa/Ndjamena -Dtests.file.encoding=UTF-8
[junit4:junit4] ERROR 0.05s J1 | TestSolr4Spatial.checkQueryEmptyIndex {p0=srpt_geohash} <<<
[junit4:junit4] > Throwable #1: java.lang.RuntimeException: Exception during query
[junit4:junit4] > at __randomizedtesting.SeedInfo.seed([A43ACD08EAE49210:A4F046E521861550]:0)
[junit4:junit4] > at org.apache.solr.SolrTestCaseJ4.assertQ(SolrTestCaseJ4.java:503)
[junit4:junit4] > at org.apache.solr.SolrTestCaseJ4.assertQ(SolrTestCaseJ4.java:470)
[junit4:junit4] > at org.apache.solr.search.TestSolr4Spatial.checkHits(TestSolr4Spatial.java:170)
[junit4:junit4] > at org.apache.solr.search.TestSolr4Spatial.checkHits(TestSolr4Spatial.java:139)
[junit4:junit4] > at org.apache.solr.search.TestSolr4Spatial.checkQueryEmptyIndex(TestSolr4Spatial.java:135)
[junit4:junit4] > at sun.reflect.NativeMethodAccessorImpl.invoke0(Native Method)
[junit4:junit4] > at sun.reflect.NativeMethodAccessorImpl.invoke(NativeMethodAccessorImpl.java:57)
[junit4:junit4] > at sun.reflect.DelegatingMethodAccessorImpl.invoke(DelegatingMethodAccessorImpl.java:43)
[junit4:junit4] > at java.lang.reflect.Method.invoke(Method.java:601)
[junit4:junit4] > at com.carrotsearch.randomizedtesting.RandomizedRunner.invoke(RandomizedRunner.java:1559)
[junit4:junit4] > at com.carrotsearch.randomizedtesting.RandomizedRunner.access$600(RandomizedRunner.java:79)
[junit4:junit4] > at com.carrotsearch.randomizedtesting.RandomizedRunner$6.evaluate(RandomizedRunner.java:737)
[junit4:junit4] > at com.carrotsearch.randomizedtesting.RandomizedRunner$7.evaluate(RandomizedRunner.java:773)
[junit4:junit4] > at com.carrotsearch.randomizedtesting.RandomizedRunner$8.evaluate(RandomizedRunner.java:787)
[junit4:junit4] > at com.carrotsearch.randomizedtesting.rules.SystemPropertiesRestoreRule$1.evaluate(SystemPropertiesRestoreRule.java:53)
[junit4:junit4] > at org.apache.lucene.util.TestRuleSetupTeardownChained$1.evaluate(TestRuleSetupTeardownChained.java:50)
[junit4:junit4] > at org.apache.lucene.util.TestRuleFieldCacheSanity$1.evaluate(TestRuleFieldCacheSanity.java:51)
[junit4:junit4] > at org.apache.lucene.util.AbstractBeforeAfterRule$1.evaluate(AbstractBeforeAfterRule.java:45)
[junit4:junit4] > at com.carrotsearch.randomizedtesting.rules.SystemPropertiesInvariantRule$1.evaluate(SystemPropertiesInvariantRule.java:55)
[junit4:junit4] > at org.apache.lucene.util.TestRuleThreadAndTestName$1.evaluate(TestRuleThreadAndTestName.java:48)
[junit4:junit4] > at org.apache.lucene.util.TestRuleIgnoreAfterMaxFailures$1.evaluate(TestRuleIgnoreAfterMaxFailures.java:70)
[junit4:junit4] > at org.apache.lucene.util.TestRuleMarkFailure$1.evaluate(TestRuleMarkFailure.java:48)
[junit4:junit4] > at com.carrotsearch.randomizedtesting.rules.StatementAdapter.evaluate(StatementAdapter.java:36)
[junit4:junit4] > at com.carrotsearch.randomizedtesting.ThreadLeakControl$StatementRunner.run(ThreadLeakControl.java:358)
[junit4:junit4] > at com.carrotsearch.randomizedtesting.ThreadLeakControl.forkTimeoutingTask(ThreadLeakControl.java:782)
[junit4:junit4] > at com.carrotsearch.randomizedtesting.ThreadLeakControl$3.evaluate(ThreadLeakControl.java:442)
[junit4:junit4] > at com.carrotsearch.randomizedtesting.RandomizedRunner.runSingleTest(RandomizedRunner.java:746)
[junit4:junit4] > at com.carrotsearch.randomizedtesting.RandomizedRunner$3.evaluate(RandomizedRunner.java:648)
[junit4:junit4] > at com.carrotsearch.randomizedtesting.RandomizedRunner$4.evaluate(RandomizedRunner.java:682)
[junit4:junit4] > at com.carrotsearch.randomizedtesting.RandomizedRunner$5.evaluate(RandomizedRunner.java:693)
[junit4:junit4] > at com.carrotsearch.randomizedtesting.rules.StatementAdapter.evaluate(StatementAdapter.java:36)
[junit4:junit4] > at com.carrotsearch.randomizedtesting.rules.SystemPropertiesRestoreRule$1.evaluate(SystemPropertiesRestoreRule.java:53)
[junit4:junit4] > at org.apache.lucene.util.AbstractBeforeAfterRule$1.evaluate(AbstractBeforeAfterRule.java:45)
[junit4:junit4] > at org.apache.lucene.util.TestRuleStoreClassName$1.evaluate(TestRuleStoreClassName.java:42)
[junit4:junit4] > at com.carrotsearch.randomizedtesting.rules.SystemPropertiesInvariantRule$1.evaluate(SystemPropertiesInvariantRule.java:55)
[junit4:junit4] > at com.carrotsearch.randomizedtesting.rules.NoShadowingOrOverridesOnMethodsRule$1.evaluate(NoShadowingOrOverridesOnMethodsRule.java:39)
[junit4:junit4] > at com.carrotsearch.randomizedtesting.rules.NoShadowingOrOverridesOnMethodsRule$1.evaluate(NoShadowingOrOverridesOnMethodsRule.java:39)
[junit4:junit4] > at com.carrotsearch.randomizedtesting.rules.StatementAdapter.evaluate(StatementAdapter.java:36)
[junit4:junit4] > at org.apache.lucene.util.TestRuleAssertionsRequired$1.evaluate(TestRuleAssertionsRequired.java:43)
[junit4:junit4] > at org.apache.lucene.util.TestRuleMarkFailure$1.evaluate(TestRuleMarkFailure.java:48)
[junit4:junit4] > at org.apache.lucene.util.TestRuleIgnoreAfterMaxFailures$1.evaluate(TestRuleIgnoreAfterMaxFailures.java:70)
[junit4:junit4] > at org.apache.lucene.util.TestRuleIgnoreTestSuites$1.evaluate(TestRuleIgnoreTestSuites.java:55)
[junit4:junit4] > at com.carrotsearch.randomizedtesting.rules.StatementAdapter.evaluate(StatementAdapter.java:36)
[junit4:junit4] > at com.carrotsearch.randomizedtesting.ThreadLeakControl$StatementRunner.run(ThreadLeakControl.java:358)
[junit4:junit4] > at java.lang.Thread.run(Thread.java:722)
[junit4:junit4] > Caused by: java.lang.RuntimeException: REQUEST FAILED: xpath=*[count(//doc)=0]
[junit4:junit4] > xml response was: <?xml version="1.0" encoding="UTF-8"?>
[junit4:junit4] > <response>
[junit4:junit4] > <lst name="responseHeader"><int name="status">0</int><int name="QTime">2</int></lst><result name="response" numFound="3" start="0"><doc><str name="id">5</str></doc><doc><str name="id">6</str></doc><doc><str name="id">7</str></doc></result>
[junit4:junit4] > </response>
[junit4:junit4] >
[junit4:junit4] > request was:fl=id&q=*:*&fq={!field+f%3Dsrpt_geohash+score%3Dnone}Intersects(Circle(0,0+d%3D0.8993203677616635))&rows=1000
[junit4:junit4] > at org.apache.solr.SolrTestCaseJ4.assertQ(SolrTestCaseJ4.java:496)
[junit4:junit4] > ... 44 more
[junit4:junit4] 2> 379 T2572 oas.SolrTestCaseJ4.setUp ###Starting testSort {p0=srpt_geohash}
[junit4:junit4] 2> 382 T2572 C190 oasu.DirectUpdateHandler2.deleteAll [collection1] REMOVING ALL DOCUMENTS FROM INDEX
[junit4:junit4] 2> 382 T2572 C190 UPDATE [collection1] webapp=null path=null params={} {deleteByQuery=*:*} 0 0
[junit4:junit4] 2> 385 T2572 C190 UPDATE [collection1] webapp=null path=null params={} {add=[100]} 0 0
[junit4:junit4] 2> 388 T2572 C190 UPDATE [collection1] webapp=null path=null params={} {add=[101]} 0 0
[junit4:junit4] 2> 391 T2572 C190 UPDATE [collection1] webapp=null path=null params={} {add=[999]} 0 1
[junit4:junit4] 2> 393 T2572 C190 oasu.DirectUpdateHandler2.commit start commit{flags=0,_version_=0,optimize=false,openSearcher=true,waitSearcher=true,expungeDeletes=false,softCommit=false}
[junit4:junit4] 2> 394 T2572 C190 oasc.SolrDeletionPolicy.onCommit SolrDeletionPolicy.onCommit: commits:num=2
[junit4:junit4] 2> commit{dir=MockDirWrapper(org.apache.lucene.store.RAMDirectory [at] 1983393 lockFactory=org.apache.lucene.store.NativeFSLockFactory [at] 21cf0b6),segFN=segments_4,generation=4,filenames=[._2.si, _2_MockVariableIntBlock_0.tii, _2_nrm.cfe, _2_MockVariableIntBlock_0.tib, _2.fdt, _2_MockVariableIntBlock_0.skp, _2_nrm.cfs, _2.fdx, _2_MockVariableIntBlock_0.doc, _2.fnm, segments_4]
[junit4:junit4] 2> commit{dir=MockDirWrapper(org.apache.lucene.store.RAMDirectory [at] 1983393 lockFactory=org.apache.lucene.store.NativeFSLockFactory [at] 21cf0b6),segFN=segments_5,generation=5,filenames=[._3.fdx, _3_nrm.cfe, _3_nrm.cfs, _3_MockVariableIntBlock_0.doc, _3_MockVariableIntBlock_0.tib, _3.si, _3.fdt, _3.fnm, segments_5, _3_MockVariableIntBlock_0.skp, _3_MockVariableIntBlock_0.tii]
[junit4:junit4] 2> 395 T2572 C190 oasc.SolrDeletionPolicy.updateCommits newest commit = 5
[junit4:junit4] 2> 396 T2572 C190 oass.SolrIndexSearcher.<init> Opening Searcher [at] 5f8132e main
[junit4:junit4] 2> 396 T2572 C190 oass.SolrIndexSearcher.getIndexDir WARNING WARNING: Directory impl does not support setting indexDir: org.apache.lucene.store.MockDirectoryWrapper
[junit4:junit4] 2> 396 T2573 oasc.SolrCore.registerSearcher [collection1] Registered new searcher Searcher [at] 5f8132e main{StandardDirectoryReader(segments_5:14 _3(5.0):C3)}
[junit4:junit4] 2> 396 T2572 C190 oasu.DirectUpdateHandler2.commit end_commit_flush
[junit4:junit4] 2> 397 T2572 C190 UPDATE [collection1] webapp=null path=null params={} {commit=} 0 4
[junit4:junit4] 2> 399 T2572 C190 REQ [collection1] webapp=null path=null params={fl=id,score&q=srpt_geohash:"Intersects(Circle(3,4+d%3D9))"} hits=2 status=0 QTime=1
[junit4:junit4] 2> 401 T2572 C190 REQ [collection1] webapp=null path=null params={sort=score+asc&fl=id,score&q={!+score%3Ddistance}srpt_geohash:"Intersects(Circle(3,4+d%3D9))"} hits=2 status=0 QTime=1
[junit4:junit4] 2> 403 T2572 C190 REQ [collection1] webapp=null path=null params={sort=score+desc&fl=id,score&q={!+score%3DrecipDistance}srpt_geohash:"Intersects(Circle(3,4+d%3D9))"} hits=2 status=0 QTime=2
[junit4:junit4] 2> 405 T2572 C190 REQ [collection1] webapp=null path=null params={sort=score+asc&fl=id,score&q={!+score%3Ddistance}srpt_geohash:"Intersects(Circle(4,0+d%3D9))"} hits=2 status=0 QTime=2
[junit4:junit4] 2> 408 T2572 C190 REQ [collection1] webapp=null path=null params={sortQuery={!+score%3Ddistance}srpt_geohash:"Intersects(Circle(3,4+d%3D9))"&sort=query($sortQuery)+asc&fl=id,score&q=-id:999} hits=2 status=0 QTime=3
[junit4:junit4] 2> 411 T2572 C190 REQ [collection1] webapp=null path=null params={sortQuery={!+score%3Ddistance}srpt_geohash:"Intersects(Circle(4,0+d%3D9))"&sort=query($sortQuery)+asc&fl=id,score&q=-id:999} hits=2 status=0 QTime=2
[junit4:junit4] 2> 412 T2572 oas.SolrTestCaseJ4.tearDown ###Ending testSort {p0=srpt_geohash}
[junit4:junit4] 2> 415 T2572 oas.SolrTestCaseJ4.setUp ###Starting testIntersectFilter {p0=srpt_geohash}
[junit4:junit4] 2> 417 T2572 C190 oasu.DirectUpdateHandler2.deleteAll [collection1] REMOVING ALL DOCUMENTS FROM INDEX
[junit4:junit4] 2> 418 T2572 C190 UPDATE [collection1] webapp=null path=null params={} {deleteByQuery=*:*} 0 1
[junit4:junit4] 2> 430 T2572 C190 UPDATE [collection1] webapp=null path=null params={} {add=[1]} 0 1
[junit4:junit4] 2> 432 T2572 C190 UPDATE [collection1] webapp=null path=null params={} {add=[2]} 0 0
[junit4:junit4] 2> 435 T2572 C190 UPDATE [collection1] webapp=null path=null params={} {add=[3]} 0 0
[junit4:junit4] 2> 437 T2572 C190 UPDATE [collection1] webapp=null path=null params={} {add=[4]} 0 0
[junit4:junit4] 2> 440 T2572 C190 UPDATE [collection1] webapp=null path=null params={} {add=[5]} 0 0
[junit4:junit4] 2> 443 T2572 C190 UPDATE [collection1] webapp=null path=null params={} {add=[6]} 0 1
[junit4:junit4] 2> 445 T2572 C190 UPDATE [collection1] webapp=null path=null params={} {add=[7]} 0 0
[junit4:junit4] 2> 447 T2572 C190 UPDATE [collection1] webapp=null path=null params={} {add=[8]} 0 0
[junit4:junit4] 2> 450 T2572 C190 UPDATE [collection1] webapp=null path=null params={} {add=[9]} 0 0
[junit4:junit4] 2> 453 T2572 C190 UPDATE [collection1] webapp=null path=null params={} {add=[10]} 0 1
[junit4:junit4] 2> 455 T2572 C190 UPDATE [collection1] webapp=null path=null params={} {add=[11]} 0 0
[junit4:junit4] 2> 458 T2572 C190 UPDATE [collection1] webapp=null path=null params={} {add=[12]} 0 1
[junit4:junit4] 2> 460 T2572 C190 UPDATE [collection1] webapp=null path=null params={} {add=[13]} 0 0
[junit4:junit4] 2> 462 T2572 C190 oasu.DirectUpdateHandler2.commit start commit{flags=0,_version_=0,optimize=false,openSearcher=true,waitSearcher=true,expungeDeletes=false,softCommit=false}
[junit4:junit4] 2> 464 T2572 C190 oasc.SolrDeletionPolicy.onCommit SolrDeletionPolicy.onCommit: commits:num=2
[junit4:junit4] 2> commit{dir=MockDirWrapper(org.apache.lucene.store.RAMDirectory [at] 1983393 lockFactory=org.apache.lucene.store.NativeFSLockFactory [at] 21cf0b6),segFN=segments_5,generation=5,filenames=[._3.fdx, _3_nrm.cfe, _3_nrm.cfs, _3_MockVariableIntBlock_0.doc, _3_MockVariableIntBlock_0.tib, _3.si, _3.fdt, _3.fnm, segments_5, _3_MockVariableIntBlock_0.skp, _3_MockVariableIntBlock_0.tii]
[junit4:junit4] 2> commit{dir=MockDirWrapper(org.apache.lucene.store.RAMDirectory [at] 1983393 lockFactory=org.apache.lucene.store.NativeFSLockFactory [at] 21cf0b6),segFN=segments_6,generation=6,filenames=[._4.fdx, _4_MockVariableIntBlock_0.skp, _4_MockVariableIntBlock_0.tib, _4_MockVariableIntBlock_0.doc, _4_nrm.cfs, _4_nrm.cfe, _4.fnm, _4.si, _4.fdt, _4_MockVariableIntBlock_0.tii, segments_6]
[junit4:junit4] 2> 464 T2572 C190 oasc.SolrDeletionPolicy.updateCommits newest commit = 6
[junit4:junit4] 2> 465 T2572 C190 oass.SolrIndexSearcher.<init> Opening Searcher [at] f7a0d9 main
[junit4:junit4] 2> 465 T2572 C190 oass.SolrIndexSearcher.getIndexDir WARNING WARNING: Directory impl does not support setting indexDir: org.apache.lucene.store.MockDirectoryWrapper
[junit4:junit4] 2> 466 T2573 oasc.SolrCore.registerSearcher [collection1] Registered new searcher Searcher [at] f7a0d9 main{StandardDirectoryReader(segments_6:17 _4(5.0):C13)}
[junit4:junit4] 2> 466 T2572 C190 oasu.DirectUpdateHandler2.commit end_commit_flush
[junit4:junit4] 2> 466 T2572 C190 UPDATE [collection1] webapp=null path=null params={} {commit=} 0 4
[junit4:junit4] 2> 469 T2572 C190 REQ [collection1] webapp=null path=null params={fl=id&q=*:*&fq={!field+f%3Dsrpt_geohash+score%3Dnone}Intersects(Circle(1,1+d%3D1.5738106435829113))&rows=1000} hits=3 status=0 QTime=2
[junit4:junit4] 2> 473 T2572 C190 REQ [collection1] webapp=null path=null params={fl=id&q=*:*&fq={!field+f%3Dsrpt_geohash+score%3Dnone}Intersects(Circle(0,179.8+d%3D1.798640735523327))&rows=1000} hits=2 status=0 QTime=2
[junit4:junit4] 2> 477 T2572 C190 REQ [collection1] webapp=null path=null params={fl=id&q=*:*&fq={!field+f%3Dsrpt_geohash+score%3Ddistance}Intersects(Circle(89.8,50+d%3D1.798640735523327))&rows=1000} hits=2 status=0 QTime=2
[junit4:junit4] 2> 480 T2572 C190 REQ [collection1] webapp=null path=null params={fl=id&q=*:*&fq={!field+f%3Dsrpt_geohash}Intersects(Circle(-89.8,50+d%3D1.798640735523327))&rows=1000} hits=2 status=0 QTime=2
[junit4:junit4] 2> 483 T2572 C190 REQ [collection1] webapp=null path=null params={fl=id&q=*:*&fq={!field+f%3Dsrpt_geohash+score%3DrecipDistance}Intersects(Circle(33.0,-80.0+d%3D2.6979611032849906))&rows=1000} hits=2 status=0 QTime=1
[junit4:junit4] 2> 485 T2572 C190 REQ [collection1] webapp=null path=null params={fl=id&q=*:*&fq={!field+f%3Dsrpt_geohash}Intersects(Circle(1,1+d%3D44.96601838808318))&rows=1000} hits=3 status=0 QTime=1
[junit4:junit4] 2> 489 T2572 C190 REQ [collection1] webapp=null path=null params={fl=id&q=*:*&fq={!field+f%3Dsrpt_geohash+score%3Dnone}Intersects(-0.034898+-0.034898+0.234898+0.234898)&rows=1000} hits=2 status=0 QTime=1
[junit4:junit4] 2> 499 T2572 C190 oasu.DirectUpdateHandler2.deleteAll [collection1] REMOVING ALL DOCUMENTS FROM INDEX
[junit4:junit4] 2> 500 T2572 C190 UPDATE [collection1] webapp=null path=null params={} {deleteByQuery=*:*} 0 1
[junit4:junit4] 2> 503 T2572 C190 UPDATE [collection1] webapp=null path=null params={} {add=[14]} 0 1
[junit4:junit4] 2> 505 T2572 C190 UPDATE [collection1] webapp=null path=null params={} {add=[15]} 0 0
[junit4:junit4] 2> 508 T2572 C190 UPDATE [collection1] webapp=null path=null params={} {add=[16]} 0 0
[junit4:junit4] 2> 510 T2572 C190 UPDATE [collection1] webapp=null path=null params={} {add=[17]} 0 0
[junit4:junit4] 2> 513 T2572 C190 oasu.DirectUpdateHandler2.commit start commit{flags=0,_version_=0,optimize=false,openSearcher=true,waitSearcher=true,expungeDeletes=false,softCommit=false}
[junit4:junit4] 2> 514 T2572 C190 oasc.SolrDeletionPolicy.onCommit SolrDeletionPolicy.onCommit: commits:num=2
[junit4:junit4] 2> commit{dir=MockDirWrapper(org.apache.lucene.store.RAMDirectory [at] 1983393 lockFactory=org.apache.lucene.store.NativeFSLockFactory [at] 21cf0b6),segFN=segments_6,generation=6,filenames=[._4.fdx, _4_MockVariableIntBlock_0.skp, _4_MockVariableIntBlock_0.tib, _4_MockVariableIntBlock_0.doc, _4_nrm.cfs, _4_nrm.cfe, _4.fnm, _4.si, _4.fdt, _4_MockVariableIntBlock_0.tii, segments_6]
[junit4:junit4] 2> commit{dir=MockDirWrapper(org.apache.lucene.store.RAMDirectory [at] 1983393 lockFactory=org.apache.lucene.store.NativeFSLockFactory [at] 21cf0b6),segFN=segments_7,generation=7,filenames=[._5.si, _5_nrm.cfe, _5_MockVariableIntBlock_0.doc, _5.fdt, _5.fnm, segments_7, _5_MockVariableIntBlock_0.tib, _5_nrm.cfs, _5_MockVariableIntBlock_0.skp, _5.fdx, _5_MockVariableIntBlock_0.tii]
[junit4:junit4] 2> 514 T2572 C190 oasc.SolrDeletionPolicy.updateCommits newest commit = 7
[junit4:junit4] 2> 515 T2572 C190 oass.SolrIndexSearcher.<init> Opening Searcher [at] 4ae6aa7 main
[junit4:junit4] 2> 515 T2572 C190 oass.SolrIndexSearcher.getIndexDir WARNING WARNING: Directory impl does not support setting indexDir: org.apache.lucene.store.MockDirectoryWrapper
[junit4:junit4] 2> 516 T2573 oasc.SolrCore.registerSearcher [collection1] Registered new searcher Searcher [at] 4ae6aa7 main{StandardDirectoryReader(segments_7:20 _5(5.0):C4)}
[junit4:junit4] 2> 516 T2572 C190 oasu.DirectUpdateHandler2.commit end_commit_flush
[junit4:junit4] 2> 516 T2572 C190 UPDATE [collection1] webapp=null path=null params={} {commit=} 0 3
[junit4:junit4] 2> 518 T2572 C190 REQ [collection1] webapp=null path=null params={fl=id&q=*:*&fq={!field+f%3Dsrpt_geohash+score%3Ddistance}Intersects(Circle(0,0+d%3D8.993203677616636))&rows=1000} hits=1 status=0 QTime=1
[junit4:junit4] 2> 521 T2572 C190 REQ [collection1] webapp=null path=null params={fl=id&q=*:*&fq={!field+f%3Dsrpt_geohash}Intersects(Circle(0,0+d%3D17.986407355233272))&rows=1000} hits=2 status=0 QTime=1
[junit4:junit4] 2> 523 T2572 C190 REQ [collection1] webapp=null path=null params={fl=id&q=*:*&fq={!field+f%3Dsrpt_geohash+score%3Ddistance}Intersects(-26.979611+-26.979611+26.979611+26.979611)&rows=1000} hits=3 status=0 QTime=0
[junit4:junit4] 2> 527 T2572 C190 REQ [collection1] webapp=null path=null params={fl=id&q=*:*&fq={!field+f%3Dsrpt_geohash}Intersects(Circle(0,0+d%3D26.98860423652752))&rows=1000} hits=3 status=0 QTime=1
[junit4:junit4] 2> 531 T2572 C190 REQ [collection1] webapp=null path=null params={fl=id&q=*:*&fq={!field+f%3Dsrpt_geohash}Intersects(Circle(0,0+d%3D26.980510353217664))&rows=1000} hits=3 status=0 QTime=1
[junit4:junit4] 2> 535 T2572 C190 REQ [collection1] webapp=null path=null params={fl=id&q=*:*&fq={!field+f%3Dsrpt_geohash}Intersects(Circle(43.517030,-96.789603+d%3D0.9802592008602133))&rows=1000} hits=0 status=0 QTime=1
[junit4:junit4] 2> 537 T2572 C190 REQ [collection1] webapp=null path=null params={fl=id&q=*:*&fq={!field+f%3Dsrpt_geohash+score%3Ddistance}Intersects(Circle(43.517030,-96.789603+d%3D0.9892524045378299))&rows=1000} hits=0 status=0 QTime=1
[junit4:junit4] 2> 539 T2572 C190 REQ [collection1] webapp=null path=null params={fl=id&q=*:*&fq={!field+f%3Dsrpt_geohash+score%3Dnone}Intersects(-98.153831+42.527778+-95.425375+44.506282)&rows=1000} hits=1 status=0 QTime=1
[junit4:junit4] 2> 540 T2572 oas.SolrTestCaseJ4.tearDown ###Ending testIntersectFilter {p0=srpt_geohash}
[junit4:junit4] 2> 543 T2572 oas.SolrTestCaseJ4.setUp ###Starting testSortMultiVal {p0=srpt_quad}
[junit4:junit4] 2> 545 T2572 C190 oasu.DirectUpdateHandler2.deleteAll [collection1] REMOVING ALL DOCUMENTS FROM INDEX
[junit4:junit4] 2> 545 T2572 C190 UPDATE [collection1] webapp=null path=null params={} {deleteByQuery=*:*} 0 0
[junit4:junit4] 2> 548 T2572 C190 oass.AbstractSpatialPrefixTreeFieldType.newSpatialStrategy srpt_quad{class=org.apache.solr.schema.SpatialRecursivePrefixTreeFieldType,analyzer=org.apache.solr.schema.FieldType$DefaultAnalyzer,args={prefixTree=quad}} strat: RecursivePrefixTreeStrategy(prefixGridScanLevel:22,SPG:(QuadPrefixTree(maxLevels:26,ctx:SpatialContext{geo=true, calculator=Haversine, worldBounds=Rect(minX=-180.0,maxX=180.0,minY=-90.0,maxY=90.0)}))) maxLevels: 26
[junit4:junit4] 2> 549 T2572 C190 UPDATE [collection1] webapp=null path=null params={} {add=[100]} 0 1
[junit4:junit4] 2> 552 T2572 C190 UPDATE [collection1] webapp=null path=null params={} {add=[101]} 0 1
[junit4:junit4] 2> 555 T2572 C190 oasu.DirectUpdateHandler2.commit start commit{flags=0,_version_=0,optimize=false,openSearcher=true,waitSearcher=true,expungeDeletes=false,softCommit=false}
[junit4:junit4] 2> 556 T2572 C190 oasc.SolrDeletionPolicy.onCommit SolrDeletionPolicy.onCommit: commits:num=2
[junit4:junit4] 2> commit{dir=MockDirWrapper(org.apache.lucene.store.RAMDirectory [at] 1983393 lockFactory=org.apache.lucene.store.NativeFSLockFactory [at] 21cf0b6),segFN=segments_7,generation=7,filenames=[._5.si, _5_nrm.cfe, _5_MockVariableIntBlock_0.doc, _5.fdt, _5.fnm, segments_7, _5_MockVariableIntBlock_0.tib, _5_nrm.cfs, _5_MockVariableIntBlock_0.skp, _5.fdx, _5_MockVariableIntBlock_0.tii]
[junit4:junit4] 2> commit{dir=MockDirWrapper(org.apache.lucene.store.RAMDirectory [at] 1983393 lockFactory=org.apache.lucene.store.NativeFSLockFactory [at] 21cf0b6),segFN=segments_8,generation=8,filenames=[._6_NestedPulsing_0.frq, _6_MockVariableIntBlock_0.tib, _6_nrm.cfe, _6.fdx, _6_MockVariableIntBlock_0.skp, segments_8, _6_nrm.cfs, _6_NestedPulsing_0.tip, _6.fnm, _6.si, _6.fdt, _6_MockVariableIntBlock_0.doc, _6_NestedPulsing_0.tim, _6_MockVariableIntBlock_0.tii]
[junit4:junit4] 2> 556 T2572 C190 oasc.SolrDeletionPolicy.updateCommits newest commit = 8
[junit4:junit4] 2> 557 T2572 C190 oass.SolrIndexSearcher.<init> Opening Searcher [at] 1ffafc main
[junit4:junit4] 2> 558 T2572 C190 oass.SolrIndexSearcher.getIndexDir WARNING WARNING: Directory impl does not support setting indexDir: org.apache.lucene.store.MockDirectoryWrapper
[junit4:junit4] 2> 558 T2573 oasc.SolrCore.registerSearcher [collection1] Registered new searcher Searcher [at] 1ffafc main{StandardDirectoryReader(segments_8:23 _6(5.0):C2)}
[junit4:junit4] 2> 558 T2572 C190 oasu.DirectUpdateHandler2.commit end_commit_flush
[junit4:junit4] 2> 558 T2572 C190 UPDATE [collection1] webapp=null path=null params={} {commit=} 0 3
[junit4:junit4] 2> 561 T2572 C190 REQ [collection1] webapp=null path=null params={sort=score+asc&fl=id,score&q={!+score%3Ddistance}srpt_quad:"Intersects(Circle(3,4+d%3D9))"} hits=2 status=0 QTime=2
[junit4:junit4] 2> 561 T2572 oas.SolrTestCaseJ4.tearDown ###Ending testSortMultiVal {p0=srpt_quad}
[junit4:junit4] 2> 564 T2572 oas.SolrTestCaseJ4.setUp ###Starting checkResultFormat {p0=srpt_quad}
[junit4:junit4] 2> 566 T2572 C190 oasu.DirectUpdateHandler2.deleteAll [collection1] REMOVING ALL DOCUMENTS FROM INDEX
[junit4:junit4] 2> 566 T2572 C190 UPDATE [collection1] webapp=null path=null params={} {deleteByQuery=*:*} 0 0
[junit4:junit4] 2> 576 T2572 C190 UPDATE [collection1] webapp=null path=null params={} {add=[11]} 0 7
[junit4:junit4] 2> 578 T2572 C190 oasu.DirectUpdateHandler2.commit start commit{flags=0,_version_=0,optimize=false,openSearcher=true,waitSearcher=true,expungeDeletes=false,softCommit=false}
[junit4:junit4] 2> 580 T2572 C190 oasc.SolrDeletionPolicy.onCommit SolrDeletionPolicy.onCommit: commits:num=2
[junit4:junit4] 2> commit{dir=MockDirWrapper(org.apache.lucene.store.RAMDirectory [at] 1983393 lockFactory=org.apache.lucene.store.NativeFSLockFactory [at] 21cf0b6),segFN=segments_8,generation=8,filenames=[._6_NestedPulsing_0.frq, _6_MockVariableIntBlock_0.tib, _6_nrm.cfe, _6.fdx, _6_MockVariableIntBlock_0.skp, segments_8, _6_nrm.cfs, _6_NestedPulsing_0.tip, _6.fnm, _6.si, _6.fdt, _6_MockVariableIntBlock_0.doc, _6_NestedPulsing_0.tim, _6_MockVariableIntBlock_0.tii]
[junit4:junit4] 2> commit{dir=MockDirWrapper(org.apache.lucene.store.RAMDirectory [at] 1983393 lockFactory=org.apache.lucene.store.NativeFSLockFactory [at] 21cf0b6),segFN=segments_9,generation=9,filenames=[._7_nrm.cfe, _7.si, _7.fdx, _7_MockVariableIntBlock_0.doc, _7.fdt, segments_9, _7.fnm, _7_NestedPulsing_0.frq, _7_nrm.cfs, _7_NestedPulsing_0.tim, _7_MockVariableIntBlock_0.tii, _7_MockVariableIntBlock_0.skp, _7_MockVariableIntBlock_0.tib, _7_NestedPulsing_0.tip]
[junit4:junit4] 2> 580 T2572 C190 oasc.SolrDeletionPolicy.updateCommits newest commit = 9
[junit4:junit4] 2> 581 T2572 C190 oass.SolrIndexSearcher.<init> Opening Searcher [at] 288bf25 main
[junit4:junit4] 2> 581 T2572 C190 oass.SolrIndexSearcher.getIndexDir WARNING WARNING: Directory impl does not support setting indexDir: org.apache.lucene.store.MockDirectoryWrapper
[junit4:junit4] 2> 582 T2573 oasc.SolrCore.registerSearcher [collection1] Registered new searcher Searcher [at] 288bf25 main{StandardDirectoryReader(segments_9:26 _7(5.0):C1)}
[junit4:junit4] 2> 582 T2572 C190 oasu.DirectUpdateHandler2.commit end_commit_flush
[junit4:junit4] 2> 582 T2572 C190 UPDATE [collection1] webapp=null path=null params={} {commit=} 0 4
[junit4:junit4] 2> 583 T2572 C190 REQ [collection1] webapp=null path=null params={fl=id,srpt_quad&q=*:*&fq={!field+needScore%3Dfalse+f%3Dsrpt_quad}Intersects(Circle(89.9,-130+d%3D9))&rows=1000} hits=1 status=0 QTime=0
[junit4:junit4] 2> 584 T2572 oas.SolrTestCaseJ4.tearDown ###Ending checkResultFormat {p0=srpt_quad}
[junit4:junit4] 2> 587 T2572 oas.SolrTestCaseJ4.setUp ###Starting testRangeSyntax {p0=srpt_quad}
[junit4:junit4] 2> 589 T2572 C190 oasu.DirectUpdateHandler2.deleteAll [collection1] REMOVING ALL DOCUMENTS FROM INDEX
[junit4:junit4] 2> 589 T2572 C190 UPDATE [collection1] webapp=null path=null params={} {deleteByQuery=*:*} 0 0
[junit4:junit4] 2> 592 T2572 C190 UPDATE [collection1] webapp=null path=null params={} {add=[1]} 0 0
[junit4:junit4] 2> 595 T2572 C190 UPDATE [collection1] webapp=null path=null params={} {add=[2]} 0 0
[junit4:junit4] 2> 598 T2572 C190 UPDATE [collection1] webapp=null path=null params={} {add=[3]} 0 0
[junit4:junit4] 2> 601 T2572 C190 UPDATE [collection1] webapp=null path=null params={} {add=[4]} 0 0
[junit4:junit4] 2> 605 T2572 C190 UPDATE [collection1] webapp=null path=null params={} {add=[5]} 0 1
[junit4:junit4] 2> 608 T2572 C190 UPDATE [collection1] webapp=null path=null params={} {add=[6]} 0 1
[junit4:junit4] 2> 611 T2572 C190 UPDATE [collection1] webapp=null path=null params={} {add=[7]} 0 1
[junit4:junit4] 2> 614 T2572 C190 UPDATE [collection1] webapp=null path=null params={} {add=[8]} 0 1
[junit4:junit4] 2> 617 T2572 C190 UPDATE [collection1] webapp=null path=null params={} {add=[9]} 0 1
[junit4:junit4] 2> 619 T2572 C190 UPDATE [collection1] webapp=null path=null params={} {add=[10]} 0 0
[junit4:junit4] 2> 622 T2572 C190 UPDATE [collection1] webapp=null path=null params={} {add=[11]} 0 0
[junit4:junit4] 2> 625 T2572 C190 UPDATE [collection1] webapp=null path=null params={} {add=[12]} 0 1
[junit4:junit4] 2> 628 T2572 C190 UPDATE [collection1] webapp=null path=null params={} {add=[13]} 0 1
[junit4:junit4] 2> 630 T2572 C190 oasu.DirectUpdateHandler2.commit start commit{flags=0,_version_=0,optimize=false,openSearcher=true,waitSearcher=true,expungeDeletes=false,softCommit=false}
[junit4:junit4] 2> 632 T2572 C190 oasc.SolrDeletionPolicy.onCommit SolrDeletionPolicy.onCommit: commits:num=2
[junit4:junit4] 2> commit{dir=MockDirWrapper(org.apache.lucene.store.RAMDirectory [at] 1983393 lockFactory=org.apache.lucene.store.NativeFSLockFactory [at] 21cf0b6),segFN=segments_9,generation=9,filenames=[._7_nrm.cfe, _7.si, _7.fdx, _7_MockVariableIntBlock_0.doc, _7.fdt, segments_9, _7.fnm, _7_NestedPulsing_0.frq, _7_nrm.cfs, _7_NestedPulsing_0.tim, _7_MockVariableIntBlock_0.tii, _7_MockVariableIntBlock_0.skp, _7_MockVariableIntBlock_0.tib, _7_NestedPulsing_0.tip]
[junit4:junit4] 2> commit{dir=MockDirWrapper(org.apache.lucene.store.RAMDirectory [at] 1983393 lockFactory=org.apache.lucene.store.NativeFSLockFactory [at] 21cf0b6),segFN=segments_a,generation=10,filenames=[._8_nrm.cfe, segments_a, _8_MockVariableIntBlock_0.tib, _8_NestedPulsing_0.frq, _8_nrm.cfs, _8.si, _8.fnm, _8_MockVariableIntBlock_0.doc, _8_MockVariableIntBlock_0.skp, _8.fdx, _8_NestedPulsing_0.tip, _8_MockVariableIntBlock_0.tii, _8.fdt, _8_NestedPulsing_0.tim]
[junit4:junit4] 2> 632 T2572 C190 oasc.SolrDeletionPolicy.updateCommits newest commit = 10
[junit4:junit4] 2> 633 T2572 C190 oass.SolrIndexSearcher.<init> Opening Searcher [at] 244f803 main
[junit4:junit4] 2> 633 T2572 C190 oass.SolrIndexSearcher.getIndexDir WARNING WARNING: Directory impl does not support setting indexDir: org.apache.lucene.store.MockDirectoryWrapper
[junit4:junit4] 2> 634 T2573 oasc.SolrCore.registerSearcher [collection1] Registered new searcher Searcher [at] 244f803 main{StandardDirectoryReader(segments_a:29 _8(5.0):C13)}
[junit4:junit4] 2> 634 T2572 C190 oasu.DirectUpdateHandler2.commit end_commit_flush
[junit4:junit4] 2> 634 T2572 C190 UPDATE [collection1] webapp=null path=null params={} {commit=} 0 4
[junit4:junit4] 2> 636 T2572 C190 REQ [collection1] webapp=null path=null params={fl=id&q=*:*&fq={!+needScore%3Dtrue+df%3Dsrpt_quad}[32,-80+TO+33,-79]&rows=1000} hits=1 status=0 QTime=1
[junit4:junit4] 2> 637 T2572 oas.SolrTestCaseJ4.tearDown ###Ending testRangeSyntax {p0=srpt_quad}
[junit4:junit4] 2> 640 T2572 oas.SolrTestCaseJ4.setUp ###Starting checkQueryEmptyIndex {p0=srpt_quad}
[junit4:junit4] 2> 642 T2572 C190 oasu.DirectUpdateHandler2.deleteAll [collection1] REMOVING ALL DOCUMENTS FROM INDEX
[junit4:junit4] 2> 642 T2572 C190 UPDATE [collection1] webapp=null path=null params={} {deleteByQuery=*:*} 0 0
[junit4:junit4] 2> 651 T2572 C190 REQ [collection1] webapp=null path=null params={fl=id&q=*:*&fq={!field+f%3Dsrpt_quad+score%3Dnone}Intersects(Circle(0,0+d%3D0.8993203677616635))&rows=1000} hits=3 status=0 QTime=8
[junit4:junit4] 2> 653 T2572 oas.SolrTestCaseJ4.assertQ SEVERE REQUEST FAILED: xpath=*[count(//doc)=0]
[junit4:junit4] 2> xml response was: <?xml version="1.0" encoding="UTF-8"?>
[junit4:junit4] 2> <response>
[junit4:junit4] 2> <lst name="responseHeader"><int name="status">0</int><int name="QTime">8</int></lst><result name="response" numFound="3" start="0"><doc><str name="id">5</str></doc><doc><str name="id">6</str></doc><doc><str name="id">7</str></doc></result>
[junit4:junit4] 2> </response>
[junit4:junit4] 2>
[junit4:junit4] 2> request was:fl=id&q=*:*&fq={!field+f%3Dsrpt_quad+score%3Dnone}Intersects(Circle(0,0+d%3D0.8993203677616635))&rows=1000
[junit4:junit4] 2> 653 T2572 oasc.SolrException.log SEVERE REQUEST FAILED: fl=id&q=*:*&fq={!field+f%3Dsrpt_quad+score%3Dnone}Intersects(Circle(0,0+d%3D0.8993203677616635))&rows=1000:java.lang.RuntimeException: REQUEST FAILED: xpath=*[count(//doc)=0]
[junit4:junit4] 2> xml response was: <?xml version="1.0" encoding="UTF-8"?>
[junit4:junit4] 2> <response>
[junit4:junit4] 2> <lst name="responseHeader"><int name="status">0</int><int name="QTime">8</int></lst><result name="response" numFound="3" start="0"><doc><str name="id">5</str></doc><doc><str name="id">6</str></doc><doc><str name="id">7</str></doc></result>
[junit4:junit4] 2> </response>
[junit4:junit4] 2>
[junit4:junit4] 2> request was:fl=id&q=*:*&fq={!field+f%3Dsrpt_quad+score%3Dnone}Intersects(Circle(0,0+d%3D0.8993203677616635))&rows=1000
[junit4:junit4] 2> at org.apache.solr.SolrTestCaseJ4.assertQ(SolrTestCaseJ4.java:496)
[junit4:junit4] 2> at org.apache.solr.SolrTestCaseJ4.assertQ(SolrTestCaseJ4.java:470)
[junit4:junit4] 2> at org.apache.solr.search.TestSolr4Spatial.checkHits(TestSolr4Spatial.java:170)
[junit4:junit4] 2> at org.apache.solr.search.TestSolr4Spatial.checkHits(TestSolr4Spatial.java:139)
[junit4:junit4] 2> at org.apache.solr.search.TestSolr4Spatial.checkQueryEmptyIndex(TestSolr4Spatial.java:135)
[junit4:junit4] 2> at sun.reflect.NativeMethodAccessorImpl.invoke0(Native Method)
[junit4:junit4] 2> at sun.reflect.NativeMethodAccessorImpl.invoke(NativeMethodAccessorImpl.java:57)
[junit4:junit4] 2> at sun.reflect.DelegatingMethodAccessorImpl.invoke(DelegatingMethodAccessorImpl.java:43)
[junit4:junit4] 2> at java.lang.reflect.Method.invoke(Method.java:601)
[junit4:junit4] 2> at com.carrotsearch.randomizedtesting.RandomizedRunner.invoke(RandomizedRunner.java:1559)
[junit4:junit4] 2> at com.carrotsearch.randomizedtesting.RandomizedRunner.access$600(RandomizedRunner.java:79)
[junit4:junit4] 2> at com.carrotsearch.randomizedtesting.RandomizedRunner$6.evaluate(RandomizedRunner.java:737)
[junit4:junit4] 2> at com.carrotsearch.randomizedtesting.RandomizedRunner$7.evaluate(RandomizedRunner.java:773)
[junit4:junit4] 2> at com.carrotsearch.randomizedtesting.RandomizedRunner$8.evaluate(RandomizedRunner.java:787)
[junit4:junit4] 2> at com.carrotsearch.randomizedtesting.rules.SystemPropertiesRestoreRule$1.evaluate(SystemPropertiesRestoreRule.java:53)
[junit4:junit4] 2> at org.apache.lucene.util.TestRuleSetupTeardownChained$1.evaluate(TestRuleSetupTeardownChained.java:50)
[junit4:junit4] 2> at org.apache.lucene.util.TestRuleFieldCacheSanity$1.evaluate(TestRuleFieldCacheSanity.java:51)
[junit4:junit4] 2> at org.apache.lucene.util.AbstractBeforeAfterRule$1.evaluate(AbstractBeforeAfterRule.java:45)
[junit4:junit4] 2> at com.carrotsearch.randomizedtesting.rules.SystemPropertiesInvariantRule$1.evaluate(SystemPropertiesInvariantRule.java:55)
[junit4:junit4] 2> at org.apache.lucene.util.TestRuleThreadAndTestName$1.evaluate(TestRuleThreadAndTestName.java:48)
[junit4:junit4] 2> at org.apache.lucene.util.TestRuleIgnoreAfterMaxFailures$1.evaluate(TestRuleIgnoreAfterMaxFailures.java:70)
[junit4:junit4] 2> at org.apache.lucene.util.TestRuleMarkFailure$1.evaluate(TestRuleMarkFailure.java:48)
[junit4:junit4] 2> at com.carrotsearch.randomizedtesting.rules.StatementAdapter.evaluate(StatementAdapter.java:36)
[junit4:junit4] 2> at com.carrotsearch.randomizedtesting.ThreadLeakControl$StatementRunner.run(ThreadLeakControl.java:358)
[junit4:junit4] 2> at com.carrotsearch.randomizedtesting.ThreadLeakControl.forkTimeoutingTask(ThreadLeakControl.java:782)
[junit4:junit4] 2> at com.carrotsearch.randomizedtesting.ThreadLeakControl$3.evaluate(ThreadLeakControl.java:442)
[junit4:junit4] 2> at com.carrotsearch.randomizedtesting.RandomizedRunner.runSingleTest(RandomizedRunner.java:746)
[junit4:junit4] 2> at com.carrotsearch.randomizedtesting.RandomizedRunner$3.evaluate(RandomizedRunner.java:648)
[junit4:junit4] 2> at com.carrotsearch.randomizedtesting.RandomizedRunner$4.evaluate(RandomizedRunner.java:682)
[junit4:junit4] 2> at com.carrotsearch.randomizedtesting.RandomizedRunner$5.evaluate(RandomizedRunner.java:693)
[junit4:junit4] 2> at com.carrotsearch.randomizedtesting.rules.StatementAdapter.evaluate(StatementAdapter.java:36)
[junit4:junit4] 2> at com.carrotsearch.randomizedtesting.rules.SystemPropertiesRestoreRule$1.evaluate(SystemPropertiesRestoreRule.java:53)
[junit4:junit4] 2> at org.apache.lucene.util.AbstractBeforeAfterRule$1.evaluate(AbstractBeforeAfterRule.java:45)
[junit4:junit4] 2> at org.apache.lucene.util.TestRuleStoreClassName$1.evaluate(TestRuleStoreClassName.java:42)
[junit4:junit4] 2> at com.carrotsearch.randomizedtesting.rules.SystemPropertiesInvariantRule$1.evaluate(SystemPropertiesInvariantRule.java:55)
[junit4:junit4] 2> at com.carrotsearch.randomizedtesting.rules.NoShadowingOrOverridesOnMethodsRule$1.evaluate(NoShadowingOrOverridesOnMethodsRule.java:39)
[junit4:junit4] 2> at com.carrotsearch.randomizedtesting.rules.NoShadowingOrOverridesOnMethodsRule$1.evaluate(NoShadowingOrOverridesOnMethodsRule.java:39)
[junit4:junit4] 2> at com.carrotsearch.randomizedtesting.rules.StatementAdapter.evaluate(StatementAdapter.java:36)
[junit4:junit4] 2> at org.apache.lucene.util.TestRuleAssertionsRequired$1.evaluate(TestRuleAssertionsRequired.java:43)
[junit4:junit4] 2> at org.apache.lucene.util.TestRuleMarkFailure$1.evaluate(TestRuleMarkFailure.java:48)
[junit4:junit4] 2> at org.apache.lucene.util.TestRuleIgnoreAfterMaxFailures$1.evaluate(TestRuleIgnoreAfterMaxFailures.java:70)
[junit4:junit4] 2> at org.apache.lucene.util.TestRuleIgnoreTestSuites$1.evaluate(TestRuleIgnoreTestSuites.java:55)
[junit4:junit4] 2> at com.carrotsearch.randomizedtesting.rules.StatementAdapter.evaluate(StatementAdapter.java:36)
[junit4:junit4] 2> at com.carrotsearch.randomizedtesting.ThreadLeakControl$StatementRunner.run(ThreadLeakControl.java:358)
[junit4:junit4] 2> at java.lang.Thread.run(Thread.java:722)
[junit4:junit4] 2>
[junit4:junit4] 2> 654 T2572 oas.SolrTestCaseJ4.tearDown ###Ending checkQueryEmptyIndex {p0=srpt_quad}
[junit4:junit4] 2> NOTE: reproduce with: ant test -Dtestcase=TestSolr4Spatial -Dtests.method="checkQueryEmptyIndex {p0=srpt_quad}" -Dtests.seed=A43ACD08EAE49210 -Dtests.multiplier=3 -Dtests.slow=true -Dtests.locale=es_CR -Dtests.timezone=Africa/Ndjamena -Dtests.file.encoding=UTF-8
[junit4:junit4] ERROR 0.02s J1 | TestSolr4Spatial.checkQueryEmptyIndex {p0=srpt_quad} <<<
[junit4:junit4] > Throwable #1: java.lang.RuntimeException: Exception during query
[junit4:junit4] > at __randomizedtesting.SeedInfo.seed([A43ACD08EAE49210:A4F046E521861550]:0)
[junit4:junit4] > at org.apache.solr.SolrTestCaseJ4.assertQ(SolrTestCaseJ4.java:503)
[junit4:junit4] > at org.apache.solr.SolrTestCaseJ4.assertQ(SolrTestCaseJ4.java:470)
[junit4:junit4] > at org.apache.solr.search.TestSolr4Spatial.checkHits(TestSolr4Spatial.java:170)
[junit4:junit4] > at org.apache.solr.search.TestSolr4Spatial.checkHits(TestSolr4Spatial.java:139)
[junit4:junit4] > at org.apache.solr.search.TestSolr4Spatial.checkQueryEmptyIndex(TestSolr4Spatial.java:135)
[junit4:junit4] > at sun.reflect.NativeMethodAccessorImpl.invoke0(Native Method)
[junit4:junit4] > at sun.reflect.NativeMethodAccessorImpl.invoke(NativeMethodAccessorImpl.java:57)
[junit4:junit4] > at sun.reflect.DelegatingMethodAccessorImpl.invoke(DelegatingMethodAccessorImpl.java:43)
[junit4:junit4] > at java.lang.reflect.Method.invoke(Method.java:601)
[junit4:junit4] > at com.carrotsearch.randomizedtesting.RandomizedRunner.invoke(RandomizedRunner.java:1559)
[junit4:junit4] > at com.carrotsearch.randomizedtesting.RandomizedRunner.access$600(RandomizedRunner.java:79)
[junit4:junit4] > at com.carrotsearch.randomizedtesting.RandomizedRunner$6.evaluate(RandomizedRunner.java:737)
[junit4:junit4] > at com.carrotsearch.randomizedtesting.RandomizedRunner$7.evaluate(RandomizedRunner.java:773)
[junit4:junit4] > at com.carrotsearch.randomizedtesting.RandomizedRunner$8.evaluate(RandomizedRunner.java:787)
[junit4:junit4] > at com.carrotsearch.randomizedtesting.rules.SystemPropertiesRestoreRule$1.evaluate(SystemPropertiesRestoreRule.java:53)
[junit4:junit4] > at org.apache.lucene.util.TestRuleSetupTeardownChained$1.evaluate(TestRuleSetupTeardownChained.java:50)
[junit4:junit4] > at org.apache.lucene.util.TestRuleFieldCacheSanity$1.evaluate(TestRuleFieldCacheSanity.java:51)
[junit4:junit4] > at org.apache.lucene.util.AbstractBeforeAfterRule$1.evaluate(AbstractBeforeAfterRule.java:45)
[junit4:junit4] > at com.carrotsearch.randomizedtesting.rules.SystemPropertiesInvariantRule$1.evaluate(SystemPropertiesInvariantRule.java:55)
[junit4:junit4] > at org.apache.lucene.util.TestRuleThreadAndTestName$1.evaluate(TestRuleThreadAndTestName.java:48)
[junit4:junit4] > at org.apache.lucene.util.TestRuleIgnoreAfterMaxFailures$1.evaluate(TestRuleIgnoreAfterMaxFailures.java:70)
[junit4:junit4] > at org.apache.lucene.util.TestRuleMarkFailure$1.evaluate(TestRuleMarkFailure.java:48)
[junit4:junit4] > at com.carrotsearch.randomizedtesting.rules.StatementAdapter.evaluate(StatementAdapter.java:36)
[junit4:junit4] > at com.carrotsearch.randomizedtesting.ThreadLeakControl$StatementRunner.run(ThreadLeakControl.java:358)
[junit4:junit4] > at com.carrotsearch.randomizedtesting.ThreadLeakControl.forkTimeoutingTask(ThreadLeakControl.java:782)
[junit4:junit4] > at com.carrotsearch.randomizedtesting.ThreadLeakControl$3.evaluate(ThreadLeakControl.java:442)
[junit4:junit4] > at com.carrotsearch.randomizedtesting.RandomizedRunner.runSingleTest(RandomizedRunner.java:746)
[junit4:junit4] > at com.carrotsearch.randomizedtesting.RandomizedRunner$3.evaluate(RandomizedRunner.java:648)
[junit4:junit4] > at com.carrotsearch.randomizedtesting.RandomizedRunner$4.evaluate(RandomizedRunner.java:682)
[junit4:junit4] > at com.carrotsearch.randomizedtesting.RandomizedRunner$5.evaluate(RandomizedRunner.java:693)
[junit4:junit4] > at com.carrotsearch.randomizedtesting.rules.StatementAdapter.evaluate(StatementAdapter.java:36)
[junit4:junit4] > at com.carrotsearch.randomizedtesting.rules.SystemPropertiesRestoreRule$1.evaluate(SystemPropertiesRestoreRule.java:53)
[junit4:junit4] > at org.apache.lucene.util.AbstractBeforeAfterRule$1.evaluate(AbstractBeforeAfterRule.java:45)
[junit4:junit4] > at org.apache.lucene.util.TestRuleStoreClassName$1.evaluate(TestRuleStoreClassName.java:42)
[junit4:junit4] > at com.carrotsearch.randomizedtesting.rules.SystemPropertiesInvariantRule$1.evaluate(SystemPropertiesInvariantRule.java:55)
[junit4:junit4] > at com.carrotsearch.randomizedtesting.rules.NoShadowingOrOverridesOnMethodsRule$1.evaluate(NoShadowingOrOverridesOnMethodsRule.java:39)
[junit4:junit4] > at com.carrotsearch.randomizedtesting.rules.NoShadowingOrOverridesOnMethodsRule$1.evaluate(NoShadowingOrOverridesOnMethodsRule.java:39)
[junit4:junit4] > at com.carrotsearch.randomizedtesting.rules.StatementAdapter.evaluate(StatementAdapter.java:36)
[junit4:junit4] > at org.apache.lucene.util.TestRuleAssertionsRequired$1.evaluate(TestRuleAssertionsRequired.java:43)
[junit4:junit4] > at org.apache.lucene.util.TestRuleMarkFailure$1.evaluate(TestRuleMarkFailure.java:48)
[junit4:junit4] > at org.apache.lucene.util.TestRuleIgnoreAfterMaxFailures$1.evaluate(TestRuleIgnoreAfterMaxFailures.java:70)
[junit4:junit4] > at org.apache.lucene.util.TestRuleIgnoreTestSuites$1.evaluate(TestRuleIgnoreTestSuites.java:55)
[junit4:junit4] > at com.carrotsearch.randomizedtesting.rules.StatementAdapter.evaluate(StatementAdapter.java:36)
[junit4:junit4] > at com.carrotsearch.randomizedtesting.ThreadLeakControl$StatementRunner.run(ThreadLeakControl.java:358)
[junit4:junit4] > at java.lang.Thread.run(Thread.java:722)
[junit4:junit4] > Caused by: java.lang.RuntimeException: REQUEST FAILED: xpath=*[count(//doc)=0]
[junit4:junit4] > xml response was: <?xml version="1.0" encoding="UTF-8"?>
[junit4:junit4] > <response>
[junit4:junit4] > <lst name="responseHeader"><int name="status">0</int><int name="QTime">8</int></lst><result name="response" numFound="3" start="0"><doc><str name="id">5</str></doc><doc><str name="id">6</str></doc><doc><str name="id">7</str></doc></result>
[junit4:junit4] > </response>
[junit4:junit4] >
[junit4:junit4] > request was:fl=id&q=*:*&fq={!field+f%3Dsrpt_quad+score%3Dnone}Intersects(Circle(0,0+d%3D0.8993203677616635))&rows=1000
[junit4:junit4] > at org.apache.solr.SolrTestCaseJ4.assertQ(SolrTestCaseJ4.java:496)
[junit4:junit4] > ... 44 more
[junit4:junit4] 2> 662 T2572 oas.SolrTestCaseJ4.setUp ###Starting testSort {p0=srpt_quad}
[junit4:junit4] 2> 663 T2572 C190 oasu.DirectUpdateHandler2.deleteAll [collection1] REMOVING ALL DOCUMENTS FROM INDEX
[junit4:junit4] 2> 664 T2572 C190 UPDATE [collection1] webapp=null path=null params={} {deleteByQuery=*:*} 0 1
[junit4:junit4] 2> 667 T2572 C190 UPDATE [collection1] webapp=null path=null params={} {add=[100]} 0 1
[junit4:junit4] 2> 670 T2572 C190 UPDATE [collection1] webapp=null path=null params={} {add=[101]} 0 1
[junit4:junit4] 2> 673 T2572 C190 UPDATE [collection1] webapp=null path=null params={} {add=[999]} 0 1
[junit4:junit4] 2> 675 T2572 C190 oasu.DirectUpdateHandler2.commit start commit{flags=0,_version_=0,optimize=false,openSearcher=true,waitSearcher=true,expungeDeletes=false,softCommit=false}
[junit4:junit4] 2> 676 T2572 C190 oasc.SolrDeletionPolicy.onCommit SolrDeletionPolicy.onCommit: commits:num=2
[junit4:junit4] 2> commit{dir=MockDirWrapper(org.apache.lucene.store.RAMDirectory [at] 1983393 lockFactory=org.apache.lucene.store.NativeFSLockFactory [at] 21cf0b6),segFN=segments_a,generation=10,filenames=[._8_nrm.cfe, segments_a, _8_MockVariableIntBlock_0.tib, _8_NestedPulsing_0.frq, _8_nrm.cfs, _8.si, _8.fnm, _8_MockVariableIntBlock_0.doc, _8_MockVariableIntBlock_0.skp, _8.fdx, _8_NestedPulsing_0.tip, _8_MockVariableIntBlock_0.tii, _8.fdt, _8_NestedPulsing_0.tim]
[junit4:junit4] 2> commit{dir=MockDirWrapper(org.apache.lucene.store.RAMDirectory [at] 1983393 lockFactory=org.apache.lucene.store.NativeFSLockFactory [at] 21cf0b6),segFN=segments_b,generation=11,filenames=[._9_MockVariableIntBlock_0.tib, _9_NestedPulsing_0.tip, _9_nrm.cfe, segments_b, _9_MockVariableIntBlock_0.skp, _9.fnm, _9_MockVariableIntBlock_0.doc, _9_nrm.cfs, _9_NestedPulsing_0.tim, _9.fdt, _9_NestedPulsing_0.frq, _9.si, _9_MockVariableIntBlock_0.tii, _9.fdx]
[junit4:junit4] 2> 677 T2572 C190 oasc.SolrDeletionPolicy.updateCommits newest commit = 11
[junit4:junit4] 2> 678 T2572 C190 oass.SolrIndexSearcher.<init> Opening Searcher [at] 92c56 main
[junit4:junit4] 2> 678 T2572 C190 oass.SolrIndexSearcher.getIndexDir WARNING WARNING: Directory impl does not support setting indexDir: org.apache.lucene.store.MockDirectoryWrapper
[junit4:junit4] 2> 678 T2572 C190 oasu.DirectUpdateHandler2.commit end_commit_flush
[junit4:junit4] 2> 679 T2573 oasc.SolrCore.registerSearcher [collection1] Registered new searcher Searcher [at] 92c56 main{StandardDirectoryReader(segments_b:33 _9(5.0):C3)}
[junit4:junit4] 2> 679 T2572 C190 UPDATE [collection1] webapp=null path=null params={} {commit=} 0 4
[junit4:junit4] 2> 681 T2572 C190 REQ [collection1] webapp=null path=null params={fl=id,score&q=srpt_quad:"Intersects(Circle(3,4+d%3D9))"} hits=2 status=0 QTime=1
[junit4:junit4] 2> 682 T2572 C190 REQ [collection1] webapp=null path=null params={sort=score+asc&fl=id,score&q={!+score%3Ddistance}srpt_quad:"Intersects(Circle(3,4+d%3D9))"} hits=2 status=0 QTime=1
[junit4:junit4] 2> 683 T2572 C190 REQ [collection1] webapp=null path=null params={sort=score+desc&fl=id,score&q={!+score%3DrecipDistance}srpt_quad:"Intersects(Circle(3,4+d%3D9))"} hits=2 status=0 QTime=1
[junit4:junit4] 2> 684 T2572 C190 REQ [collection1] webapp=null path=null params={sort=score+asc&fl=id,score&q={!+score%3Ddistance}srpt_quad:"Intersects(Circle(4,0+d%3D9))"} hits=2 status=0 QTime=1
[junit4:junit4] 2> 685 T2572 C190 REQ [collection1] webapp=null path=null params={sortQuery={!+score%3Ddistance}srpt_quad:"Intersects(Circle(3,4+d%3D9))"&sort=query($sortQuery)+asc&fl=id,score&q=-id:999} hits=2 status=0 QTime=1
[junit4:junit4] 2> 686 T2572 C190 REQ [collection1] webapp=null path=null params={sortQuery={!+score%3Ddistance}srpt_quad:"Intersects(Circle(4,0+d%3D9))"&sort=query($sortQuery)+asc&fl=id,score&q=-id:999} hits=2 status=0 QTime=1
[junit4:junit4] 2> 687 T2572 oas.SolrTestCaseJ4.tearDown ###Ending testSort {p0=srpt_quad}
[junit4:junit4] 2> 689 T2572 oas.SolrTestCaseJ4.setUp ###Starting testIntersectFilter {p0=srpt_quad}
[junit4:junit4] 2> 691 T2572 C190 oasu.DirectUpdateHandler2.deleteAll [collection1] REMOVING ALL DOCUMENTS FROM INDEX
[junit4:junit4] 2> 692 T2572 C190 UPDATE [collection1] webapp=null path=null params={} {deleteByQuery=*:*} 0 1
[junit4:junit4] 2> 695 T2572 C190 UPDATE [collection1] webapp=null path=null params={} {add=[1]} 0 1
[junit4:junit4] 2> 697 T2572 C190 UPDATE [collection1] webapp=null path=null params={} {add=[2]} 0 0
[junit4:junit4] 2> 700 T2572 C190 UPDATE [collection1] webapp=null path=null params={} {add=[3]} 0 0
[junit4:junit4] 2> 703 T2572 C190 UPDATE [collection1] webapp=null path=null params={} {add=[4]} 0 1
[junit4:junit4] 2> 706 T2572 C190 UPDATE [collection1] webapp=null path=null params={} {add=[5]} 0 1
[junit4:junit4] 2> 709 T2572 C190 UPDATE [collection1] webapp=null path=null params={} {add=[6]} 0 1
[junit4:junit4] 2> 711 T2572 C190 UPDATE [collection1] webapp=null path=null params={} {add=[7]} 0 0
[junit4:junit4] 2> 714 T2572 C190 UPDATE [collection1] webapp=null path=null params={} {add=[8]} 0 0
[junit4:junit4] 2> 717 T2572 C190 UPDATE [collection1] webapp=null path=null params={} {add=[9]} 0 1
[junit4:junit4] 2> 720 T2572 C190 UPDATE [collection1] webapp=null path=null params={} {add=[10]} 0 1
[junit4:junit4] 2> 729 T2572 C190 UPDATE [collection1] webapp=null path=null params={} {add=[11]} 0 1
[junit4:junit4] 2> 732 T2572 C190 UPDATE [collection1] webapp=null path=null params={} {add=[12]} 0 1
[junit4:junit4] 2> 734 T2572 C190 UPDATE [collection1] webapp=null path=null params={} {add=[13]} 0 0
[junit4:junit4] 2> 737 T2572 C190 oasu.DirectUpdateHandler2.commit start commit{flags=0,_version_=0,optimize=false,openSearcher=true,waitSearcher=true,expungeDeletes=false,softCommit=false}
[junit4:junit4] 2> 738 T2572 C190 oasc.SolrDeletionPolicy.onCommit SolrDeletionPolicy.onCommit: commits:num=2
[junit4:junit4] 2> commit{dir=MockDirWrapper(org.apache.lucene.store.RAMDirectory [at] 1983393 lockFactory=org.apache.lucene.store.NativeFSLockFactory [at] 21cf0b6),segFN=segments_b,generation=11,filenames=[._9_MockVariableIntBlock_0.tib, _9_NestedPulsing_0.tip, _9_nrm.cfe, segments_b, _9_MockVariableIntBlock_0.skp, _9.fnm, _9_MockVariableIntBlock_0.doc, _9_nrm.cfs, _9_NestedPulsing_0.tim, _9.fdt, _9_NestedPulsing_0.frq, _9.si, _9_MockVariableIntBlock_0.tii, _9.fdx]
[junit4:junit4] 2> commit{dir=MockDirWrapper(org.apache.lucene.store.RAMDirectory [at] 1983393 lockFactory=org.apache.lucene.store.NativeFSLockFactory [at] 21cf0b6),segFN=segments_c,generation=12,filenames=[.segments_c, _a_nrm.cfe, _a_NestedPulsing_0.tim, _a_NestedPulsing_0.frq, _a.fdt, _a.si, _a_nrm.cfs, _a_MockVariableIntBlock_0.doc, _a.fdx, _a_MockVariableIntBlock_0.skp, _a_MockVariableIntBlock_0.tii, _a_NestedPulsing_0.tip, _a_MockVariableIntBlock_0.tib, _a.fnm]
[junit4:junit4] 2> 739 T2572 C190 oasc.SolrDeletionPolicy.updateCommits newest commit = 12
[junit4:junit4] 2> 740 T2572 C190 oass.SolrIndexSearcher.<init> Opening Searcher [at] 758a2b7 main
[junit4:junit4] 2> 740 T2572 C190 oass.SolrIndexSearcher.getIndexDir WARNING WARNING: Directory impl does not support setting indexDir: org.apache.lucene.store.MockDirectoryWrapper
[junit4:junit4] 2> 741 T2573 oasc.SolrCore.registerSearcher [collection1] Registered new searcher Searcher [at] 758a2b7 main{StandardDirectoryReader(segments_c:36 _a(5.0):C13)}
[junit4:junit4] 2> 741 T2572 C190 oasu.DirectUpdateHandler2.commit end_commit_flush
[junit4:junit4] 2> 741 T2572 C190 UPDATE [collection1] webapp=null path=null params={} {commit=} 0 4
[junit4:junit4] 2> 744 T2572 C190 REQ [collection1] webapp=null path=null params={fl=id&q=*:*&fq={!field+f%3Dsrpt_quad+score%3Dnone}Intersects(Circle(1,1+d%3D1.5738106435829113))&rows=1000} hits=3 status=0 QTime=2
[junit4:junit4] 2> 747 T2572 C190 REQ [collection1] webapp=null path=null params={fl=id&q=*:*&fq={!field+f%3Dsrpt_quad+score%3Dnone}Intersects(Circle(0,179.8+d%3D1.798640735523327))&rows=1000} hits=2 status=0 QTime=1
[junit4:junit4] 2> 750 T2572 C190 REQ [collection1] webapp=null path=null params={fl=id&q=*:*&fq={!field+f%3Dsrpt_quad+score%3Ddistance}Intersects(Circle(89.8,50+d%3D1.798640735523327))&rows=1000} hits=2 status=0 QTime=1
[junit4:junit4] 2> 753 T2572 C190 REQ [collection1] webapp=null path=null params={fl=id&q=*:*&fq={!field+f%3Dsrpt_quad}Intersects(Circle(-89.8,50+d%3D1.798640735523327))&rows=1000} hits=2 status=0 QTime=1
[junit4:junit4] 2> 756 T2572 C190 REQ [collection1] webapp=null path=null params={fl=id&q=*:*&fq={!field+f%3Dsrpt_quad+score%3DrecipDistance}Intersects(Circle(33.0,-80.0+d%3D2.6979611032849906))&rows=1000} hits=2 status=0 QTime=1
[junit4:junit4] 2> 757 T2572 C190 REQ [collection1] webapp=null path=null params={fl=id&q=*:*&fq={!field+f%3Dsrpt_quad}Intersects(Circle(1,1+d%3D44.96601838808318))&rows=1000} hits=3 status=0 QTime=0
[junit4:junit4] 2> 761 T2572 C190 REQ [collection1] webapp=null path=null params={fl=id&q=*:*&fq={!field+f%3Dsrpt_quad+score%3Dnone}Intersects(-0.034898+-0.034898+0.234898+0.234898)&rows=1000} hits=2 status=0 QTime=1
[junit4:junit4] 2> 765 T2572 C190 oasu.DirectUpdateHandler2.deleteAll [collection1] REMOVING ALL DOCUMENTS FROM INDEX
[junit4:junit4] 2> 765 T2572 C190 UPDATE [collection1] webapp=null path=null params={} {deleteByQuery=*:*} 0 0
[junit4:junit4] 2> 768 T2572 C190 UPDATE [collection1] webapp=null path=null params={} {add=[14]} 0 0
[junit4:junit4] 2> 771 T2572 C190 UPDATE [collection1] webapp=null path=null params={} {add=[15]} 0 0
[junit4:junit4] 2> 774 T2572 C190 UPDATE [collection1] webapp=null path=null params={} {add=[16]} 0 1
[junit4:junit4] 2> 776 T2572 C190 UPDATE [collection1] webapp=null path=null params={} {add=[17]} 0 0
[junit4:junit4] 2> 779 T2572 C190 oasu.DirectUpdateHandler2.commit start commit{flags=0,_version_=0,optimize=false,openSearcher=true,waitSearcher=true,expungeDeletes=false,softCommit=false}
[junit4:junit4] 2> 780 T2572 C190 oasc.SolrDeletionPolicy.onCommit SolrDeletionPolicy.onCommit: commits:num=2
[junit4:junit4] 2> commit{dir=MockDirWrapper(org.apache.lucene.store.RAMDirectory [at] 1983393 lockFactory=org.apache.lucene.store.NativeFSLockFactory [at] 21cf0b6),segFN=segments_c,generation=12,filenames=[.segments_c, _a_nrm.cfe, _a_NestedPulsing_0.tim, _a_NestedPulsing_0.frq, _a.fdt, _a.si, _a_nrm.cfs, _a_MockVariableIntBlock_0.doc, _a.fdx, _a_MockVariableIntBlock_0.skp, _a_MockVariableIntBlock_0.tii, _a_NestedPulsing_0.tip, _a_MockVariableIntBlock_0.tib, _a.fnm]
[junit4:junit4] 2> commit{dir=MockDirWrapper(org.apache.lucene.store.RAMDirectory [at] 1983393 lockFactory=org.apache.lucene.store.NativeFSLockFactory [at] 21cf0b6),segFN=segments_d,generation=13,filenames=[.segments_d, _b_MockVariableIntBlock_0.doc, _b_NestedPulsing_0.tim, _b_MockVariableIntBlock_0.tii, _b_NestedPulsing_0.tip, _b.si, _b_nrm.cfe, _b_NestedPulsing_0.frq, _b_MockVariableIntBlock_0.tib, _b.fnm, _b_MockVariableIntBlock_0.skp, _b.fdt, _b_nrm.cfs, _b.fdx]
[junit4:junit4] 2> 780 T2572 C190 oasc.SolrDeletionPolicy.updateCommits newest commit = 13
[junit4:junit4] 2> 781 T2572 C190 oass.SolrIndexSearcher.<init> Opening Searcher [at] 98c3bc main
[junit4:junit4] 2> 782 T2572 C190 oass.SolrIndexSearcher.getIndexDir WARNING WARNING: Directory impl does not support setting indexDir: org.apache.lucene.store.MockDirectoryWrapper
[junit4:junit4] 2> 782 T2573 oasc.SolrCore.registerSearcher [collection1] Registered new searcher Searcher [at] 98c3bc main{StandardDirectoryReader(segments_d:39 _b(5.0):C4)}
[junit4:junit4] 2> 782 T2572 C190 oasu.DirectUpdateHandler2.commit end_commit_flush
[junit4:junit4] 2> 783 T2572 C190 UPDATE [collection1] webapp=null path=null params={} {commit=} 0 4
[junit4:junit4] 2> 784 T2572 C190 REQ [collection1] webapp=null path=null params={fl=id&q=*:*&fq={!field+f%3Dsrpt_quad+score%3Ddistance}Intersects(Circle(0,0+d%3D8.993203677616636))&rows=1000} hits=1 status=0 QTime=1
[junit4:junit4] 2> 786 T2572 C190 REQ [collection1] webapp=null path=null params={fl=id&q=*:*&fq={!field+f%3Dsrpt_quad}Intersects(Circle(0,0+d%3D17.986407355233272))&rows=1000} hits=2 status=0 QTime=0
[junit4:junit4] 2> 789 T2572 C190 REQ [collection1] webapp=null path=null params={fl=id&q=*:*&fq={!field+f%3Dsrpt_quad+score%3Ddistance}Intersects(-26.979611+-26.979611+26.979611+26.979611)&rows=1000} hits=3 status=0 QTime=1
[junit4:junit4] 2> 792 T2572 C190 REQ [collection1] webapp=null path=null params={fl=id&q=*:*&fq={!field+f%3Dsrpt_quad}Intersects(Circle(0,0+d%3D26.98860423652752))&rows=1000} hits=3 status=0 QTime=1
[junit4:junit4] 2> 802 T2572 C190 REQ [collection1] webapp=null path=null params={fl=id&q=*:*&fq={!field+f%3Dsrpt_quad}Intersects(Circle(0,0+d%3D26.980510353217664))&rows=1000} hits=3 status=0 QTime=1
[junit4:junit4] 2> 805 T2572 C190 REQ [collection1] webapp=null path=null params={fl=id&q=*:*&fq={!field+f%3Dsrpt_quad}Intersects(Circle(43.517030,-96.789603+d%3D0.9802592008602133))&rows=1000} hits=0 status=0 QTime=1
[junit4:junit4] 2> 806 T2572 C190 REQ [collection1] webapp=null path=null params={fl=id&q=*:*&fq={!field+f%3Dsrpt_quad+score%3Ddistance}Intersects(Circle(43.517030,-96.789603+d%3D0.9892524045378299))&rows=1000} hits=0 status=0 QTime=0
[junit4:junit4] 2> 808 T2572 C190 REQ [collection1] webapp=null path=null params={fl=id&q=*:*&fq={!field+f%3Dsrpt_quad+score%3Dnone}Intersects(-98.153831+42.527778+-95.425375+44.506282)&rows=1000} hits=1 status=0 QTime=1
[junit4:junit4] 2> 809 T2572 oas.SolrTestCaseJ4.tearDown ###Ending testIntersectFilter {p0=srpt_quad}
[junit4:junit4] 2> 812 T2572 oas.SolrTestCaseJ4.setUp ###Starting testSortMultiVal {p0=stqpt_geohash}
[junit4:junit4] 2> 814 T2572 C190 oasu.DirectUpdateHandler2.deleteAll [collection1] REMOVING ALL DOCUMENTS FROM INDEX
[junit4:junit4] 2> 815 T2572 C190 UPDATE [collection1] webapp=null path=null params={} {deleteByQuery=*:*} 0 1
[junit4:junit4] 2> 819 T2572 C190 oass.AbstractSpatialPrefixTreeFieldType.newSpatialStrategy stqpt_geohash{class=org.apache.solr.schema.SpatialTermQueryPrefixTreeFieldType,analyzer=org.apache.solr.schema.FieldType$DefaultAnalyzer,args={prefixTree=geohash}} strat: TermQueryPrefixTreeStrategy field:stqpt_geohash ctx=SpatialContext{geo=true, calculator=Haversine, worldBounds=Rect(minX=-180.0,maxX=180.0,minY=-90.0,maxY=90.0)} maxLevels: 11
[junit4:junit4] 2> 819 T2572 C190 UPDATE [collection1] webapp=null path=null params={} {add=[100]} 0 2
[junit4:junit4] 2> 822 T2572 C190 UPDATE [collection1] webapp=null path=null params={} {add=[101]} 0 0
[junit4:junit4] 2> 824 T2572 C190 oasu.DirectUpdateHandler2.commit start commit{flags=0,_version_=0,optimize=false,openSearcher=true,waitSearcher=true,expungeDeletes=false,softCommit=false}
[junit4:junit4] 2> 826 T2572 C190 oasc.SolrDeletionPolicy.onCommit SolrDeletionPolicy.onCommit: commits:num=2
[junit4:junit4] 2> commit{dir=MockDirWrapper(org.apache.lucene.store.RAMDirectory [at] 1983393 lockFactory=org.apache.lucene.store.NativeFSLockFactory [at] 21cf0b6),segFN=segments_d,generation=13,filenames=[.segments_d, _b_MockVariableIntBlock_0.doc, _b_NestedPulsing_0.tim, _b_MockVariableIntBlock_0.tii, _b_NestedPulsing_0.tip, _b.si, _b_nrm.cfe, _b_NestedPulsing_0.frq, _b_MockVariableIntBlock_0.tib, _b.fnm, _b_MockVariableIntBlock_0.skp, _b.fdt, _b_nrm.cfs, _b.fdx]
[junit4:junit4] 2> commit{dir=MockDirWrapper(org.apache.lucene.store.RAMDirectory [at] 1983393 lockFactory=org.apache.lucene.store.NativeFSLockFactory [at] 21cf0b6),segFN=segments_e,generation=14,filenames=[.segments_e, _c_nrm.cfe, _c_MockVariableIntBlock_0.doc, _c_TestBloomFilteredLucene40Postings_0.frq, _c.fdx, _c_MockVariableIntBlock_0.tii, _c.fdt, _c.si, _c_TestBloomFilteredLucene40Postings_0.tim, _c_TestBloomFilteredLucene40Postings_0.blm, _c_MockVariableIntBlock_0.tib, _c_nrm.cfs, _c_MockVariableIntBlock_0.skp, _c.fnm, _c_TestBloomFilteredLucene40Postings_0.tip]
[junit4:junit4] 2> 826 T2572 C190 oasc.SolrDeletionPolicy.updateCommits newest commit = 14
[junit4:junit4] 2> 827 T2572 C190 oass.SolrIndexSearcher.<init> Opening Searcher [at] 3604594 main
[junit4:junit4] 2> 827 T2572 C190 oass.SolrIndexSearcher.getIndexDir WARNING WARNING: Directory impl does not support setting indexDir: org.apache.lucene.store.MockDirectoryWrapper
[junit4:junit4] 2> 828 T2573 oasc.SolrCore.registerSearcher [collection1] Registered new searcher Searcher [at] 3604594 main{StandardDirectoryReader(segments_e:42 _c(5.0):C2)}
[junit4:junit4] 2> 828 T2572 C190 oasu.DirectUpdateHandler2.commit end_commit_flush
[junit4:junit4] 2> 828 T2572 C190 UPDATE [collection1] webapp=null path=null params={} {commit=} 0 4
[junit4:junit4] 2> 919 T2572 C190 REQ [collection1] webapp=null path=null params={sort=score+asc&fl=id,score&q={!+score%3Ddistance}stqpt_geohash:"Intersects(Circle(3,4+d%3D9))"} hits=2 status=0 QTime=90
[junit4:junit4] 2> 920 T2572 oas.SolrTestCaseJ4.tearDown ###Ending testSortMultiVal {p0=stqpt_geohash}
[junit4:junit4] 2> 923 T2572 oas.SolrTestCaseJ4.setUp ###Starting checkResultFormat {p0=stqpt_geohash}
[junit4:junit4] 2> 925 T2572 C190 oasu.DirectUpdateHandler2.deleteAll [collection1] REMOVING ALL DOCUMENTS FROM INDEX
[junit4:junit4] 2> 925 T2572 C190 UPDATE [collection1] webapp=null path=null params={} {deleteByQuery=*:*} 0 1
[junit4:junit4] 2> 928 T2572 C190 UPDATE [collection1] webapp=null path=null params={} {add=[11]} 0 0
[junit4:junit4] 2> 931 T2572 C190 oasu.DirectUpdateHandler2.commit start commit{flags=0,_version_=0,optimize=false,openSearcher=true,waitSearcher=true,expungeDeletes=false,softCommit=false}
[junit4:junit4] 2> 932 T2572 C190 oasc.SolrDeletionPolicy.onCommit SolrDeletionPolicy.onCommit: commits:num=2
[junit4:junit4] 2> commit{dir=MockDirWrapper(org.apache.lucene.store.RAMDirectory [at] 1983393 lockFactory=org.apache.lucene.store.NativeFSLockFactory [at] 21cf0b6),segFN=segments_e,generation=14,filenames=[.segments_e, _c_nrm.cfe, _c_MockVariableIntBlock_0.doc, _c_TestBloomFilteredLucene40Postings_0.frq, _c.fdx, _c_MockVariableIntBlock_0.tii, _c.fdt, _c.si, _c_TestBloomFilteredLucene40Postings_0.tim, _c_TestBloomFilteredLucene40Postings_0.blm, _c_MockVariableIntBlock_0.tib, _c_nrm.cfs, _c_MockVariableIntBlock_0.skp, _c.fnm, _c_TestBloomFilteredLucene40Postings_0.tip]
[junit4:junit4] 2> commit{dir=MockDirWrapper(org.apache.lucene.store.RAMDirectory [at] 1983393 lockFactory=org.apache.lucene.store.NativeFSLockFactory [at] 21cf0b6),segFN=segments_f,generation=15,filenames=[.segments_f, _d_TestBloomFilteredLucene40Postings_0.tip, _d_TestBloomFilteredLucene40Postings_0.tim, _d.fnm, _d_MockVariableIntBlock_0.tib, _d_TestBloomFilteredLucene40Postings_0.blm, _d_MockVariableIntBlock_0.doc, _d_nrm.cfs, _d.fdx, _d_MockVariableIntBlock_0.tii, _d.fdt, _d.si, _d_TestBloomFilteredLucene40Postings_0.frq, _d_nrm.cfe, _d_MockVariableIntBlock_0.skp]
[junit4:junit4] 2> 932 T2572 C190 oasc.SolrDeletionPolicy.updateCommits newest commit = 15
[junit4:junit4] 2> 933 T2572 C190 oass.SolrIndexSearcher.<init> Opening Searcher [at] 77c78e6 main
[junit4:junit4] 2> 934 T2572 C190 oass.SolrIndexSearcher.getIndexDir WARNING WARNING: Directory impl does not support setting indexDir: org.apache.lucene.store.MockDirectoryWrapper
[junit4:junit4] 2> 934 T2573 oasc.SolrCore.registerSearcher [collection1] Registered new searcher Searcher [at] 77c78e6 main{StandardDirectoryReader(segments_f:45 _d(5.0):C1)}
[junit4:junit4] 2> 934 T2572 C190 oasu.DirectUpdateHandler2.commit end_commit_flush
[junit4:junit4] 2> 935 T2572 C190 UPDATE [collection1] webapp=null path=null params={} {commit=} 0 5
[junit4:junit4] 2> 1057 T2572 C190 REQ [collection1] webapp=null path=null params={fl=id,stqpt_geohash&q=*:*&fq={!field+needScore%3Dfalse+f%3Dstqpt_geohash}Intersects(Circle(89.9,-130+d%3D9))&rows=1000} hits=1 status=0 QTime=121
[junit4:junit4] 2> 1059 T2572 oas.SolrTestCaseJ4.tearDown ###Ending checkResultFormat {p0=stqpt_geohash}
[junit4:junit4] 2> 1062 T2572 oas.SolrTestCaseJ4.setUp ###Starting testRangeSyntax {p0=stqpt_geohash}
[junit4:junit4] 2> 1064 T2572 C190 oasu.DirectUpdateHandler2.deleteAll [collection1] REMOVING ALL DOCUMENTS FROM INDEX
[junit4:junit4] 2> 1064 T2572 C190 UPDATE [collection1] webapp=null path=null params={} {deleteByQuery=*:*} 0 0
[junit4:junit4] 2> 1073 T2572 C190 UPDATE [collection1] webapp=null path=null params={} {add=[1]} 0 0
[junit4:junit4] 2> 1076 T2572 C190 UPDATE [collection1] webapp=null path=null params={} {add=[2]} 0 0
[junit4:junit4] 2> 1078 T2572 C190 UPDATE [collection1] webapp=null path=null params={} {add=[3]} 0 0
[junit4:junit4] 2> 1081 T2572 C190 UPDATE [collection1] webapp=null path=null params={} {add=[4]} 0 0
[junit4:junit4] 2> 1083 T2572 C190 UPDATE [collection1] webapp=null path=null params={} {add=[5]} 0 0
[junit4:junit4] 2> 1086 T2572 C190 UPDATE [collection1] webapp=null path=null params={} {add=[6]} 0 0
[junit4:junit4] 2> 1088 T2572 C190 UPDATE [collection1] webapp=null path=null params={} {add=[7]} 0 0
[junit4:junit4] 2> 1091 T2572 C190 UPDATE [collection1] webapp=null path=null params={} {add=[8]} 0 0
[junit4:junit4] 2> 1093 T2572 C190 UPDATE [collection1] webapp=null path=null params={} {add=[9]} 0 0
[junit4:junit4] 2> 1096 T2572 C190 UPDATE [collection1] webapp=null path=null params={} {add=[10]} 0 1
[junit4:junit4] 2> 1098 T2572 C190 UPDATE [collection1] webapp=null path=null params={} {add=[11]} 0 0
[junit4:junit4] 2> 1101 T2572 C190 UPDATE [collection1] webapp=null path=null params={} {add=[12]} 0 1
[junit4:junit4] 2> 1103 T2572 C190 UPDATE [collection1] webapp=null path=null params={} {add=[13]} 0 0
[junit4:junit4] 2> 1105 T2572 C190 oasu.DirectUpdateHandler2.commit start commit{flags=0,_version_=0,optimize=false,openSearcher=true,waitSearcher=true,expungeDeletes=false,softCommit=false}
[junit4:junit4] 2> 1107 T2572 C190 oasc.SolrDeletionPolicy.onCommit SolrDeletionPolicy.onCommit: commits:num=2
[junit4:junit4] 2> commit{dir=MockDirWrapper(org.apache.lucene.store.RAMDirectory [at] 1983393 lockFactory=org.apache.lucene.store.NativeFSLockFactory [at] 21cf0b6),segFN=segments_f,generation=15,filenames=[.segments_f, _d_TestBloomFilteredLucene40Postings_0.tip, _d_TestBloomFilteredLucene40Postings_0.tim, _d.fnm, _d_MockVariableIntBlock_0.tib, _d_TestBloomFilteredLucene40Postings_0.blm, _d_MockVariableIntBlock_0.doc, _d_nrm.cfs, _d.fdx, _d_MockVariableIntBlock_0.tii, _d.fdt, _d.si, _d_TestBloomFilteredLucene40Postings_0.frq, _d_nrm.cfe, _d_MockVariableIntBlock_0.skp]
[junit4:junit4] 2> commit{dir=MockDirWrapper(org.apache.lucene.store.RAMDirectory [at] 1983393 lockFactory=org.apache.lucene.store.NativeFSLockFactory [at] 21cf0b6),segFN=segments_g,generation=16,filenames=[._e_MockVariableIntBlock_0.doc, _e_MockVariableIntBlock_0.tii, _e.fdx, _e_TestBloomFilteredLucene40Postings_0.frq, segments_g, _e_nrm.cfe, _e_MockVariableIntBlock_0.tib, _e.si, _e_MockVariableIntBlock_0.skp, _e_TestBloomFilteredLucene40Postings_0.blm, _e.fdt, _e_nrm.cfs, _e_TestBloomFilteredLucene40Postings_0.tim, _e.fnm, _e_TestBloomFilteredLucene40Postings_0.tip]
[junit4:junit4] 2> 1107 T2572 C190 oasc.SolrDeletionPolicy.updateCommits newest commit = 16
[junit4:junit4] 2> 1108 T2572 C190 oass.SolrIndexSearcher.<init> Opening Searcher [at] 4223aee main
[junit4:junit4] 2> 1109 T2572 C190 oass.SolrIndexSearcher.getIndexDir WARNING WARNING: Directory impl does not support setting indexDir: org.apache.lucene.store.MockDirectoryWrapper
[junit4:junit4] 2> 1109 T2573 oasc.SolrCore.registerSearcher [collection1] Registered new searcher Searcher [at] 4223aee main{StandardDirectoryReader(segments_g:48 _e(5.0):C13)}
[junit4:junit4] 2> 1109 T2572 C190 oasu.DirectUpdateHandler2.commit end_commit_flush
[junit4:junit4] 2> 1109 T2572 C190 UPDATE [collection1] webapp=null path=null params={} {commit=} 0 4
[junit4:junit4] 2> 1115 T2572 C190 REQ [collection1] webapp=null path=null params={fl=id&q=*:*&fq={!+needScore%3Dtrue+df%3Dstqpt_geohash}[32,-80+TO+33,-79]&rows=1000} hits=1 status=0 QTime=5
[junit4:junit4] 2> 1117 T2572 oas.SolrTestCaseJ4.tearDown ###Ending testRangeSyntax {p0=stqpt_geohash}
[junit4:junit4] 2> 1120 T2572 oas.SolrTestCaseJ4.setUp ###Starting checkQueryEmptyIndex {p0=stqpt_geohash}
[junit4:junit4] 2> 1122 T2572 C190 oasu.DirectUpdateHandler2.deleteAll [collection1] REMOVING ALL DOCUMENTS FROM INDEX
[junit4:junit4] 2> 1123 T2572 C190 UPDATE [collection1] webapp=null path=null params={} {deleteByQuery=*:*} 0 1
[junit4:junit4] 2> 1134 T2572 C190 REQ [collection1] webapp=null path=null params={fl=id&q=*:*&fq={!field+f%3Dstqpt_geohash+score%3Dnone}Intersects(Circle(0,0+d%3D0.8993203677616635))&rows=1000} hits=3 status=0 QTime=10
[junit4:junit4] 2> 1135 T2572 oas.SolrTestCaseJ4.assertQ SEVERE REQUEST FAILED: xpath=*[count(//doc)=0]
[junit4:junit4] 2> xml response was: <?xml version="1.0" encoding="UTF-8"?>
[junit4:junit4] 2> <response>
[junit4:junit4] 2> <lst name="responseHeader"><int name="status">0</int><int name="QTime">10</int></lst><result name="response" numFound="3" start="0"><doc><str name="id">5</str></doc><doc><str name="id">6</str></doc><doc><str name="id">7</str></doc></result>
[junit4:junit4] 2> </response>
[junit4:junit4] 2>
[junit4:junit4] 2> request was:fl=id&q=*:*&fq={!field+f%3Dstqpt_geohash+score%3Dnone}Intersects(Circle(0,0+d%3D0.8993203677616635))&rows=1000
[junit4:junit4] 2> 1136 T2572 oasc.SolrException.log SEVERE REQUEST FAILED: fl=id&q=*:*&fq={!field+f%3Dstqpt_geohash+score%3Dnone}Intersects(Circle(0,0+d%3D0.8993203677616635))&rows=1000:java.lang.RuntimeException: REQUEST FAILED: xpath=*[count(//doc)=0]
[junit4:junit4] 2> xml response was: <?xml version="1.0" encoding="UTF-8"?>
[junit4:junit4] 2> <response>
[junit4:junit4] 2> <lst name="responseHeader"><int name="status">0</int><int name="QTime">10</int></lst><result name="response" numFound="3" start="0"><doc><str name="id">5</str></doc><doc><str name="id">6</str></doc><doc><str name="id">7</str></doc></result>
[junit4:junit4] 2> </response>
[junit4:junit4] 2>
[junit4:junit4] 2> request was:fl=id&q=*:*&fq={!field+f%3Dstqpt_geohash+score%3Dnone}Intersects(Circle(0,0+d%3D0.8993203677616635))&rows=1000
[junit4:junit4] 2> at org.apache.solr.SolrTestCaseJ4.assertQ(SolrTestCaseJ4.java:496)
[junit4:junit4] 2> at org.apache.solr.SolrTestCaseJ4.assertQ(SolrTestCaseJ4.java:470)
[junit4:junit4] 2> at org.apache.solr.search.TestSolr4Spatial.checkHits(TestSolr4Spatial.java:170)
[junit4:junit4] 2> at org.apache.solr.search.TestSolr4Spatial.checkHits(TestSolr4Spatial.java:139)
[junit4:junit4] 2> at org.apache.solr.search.TestSolr4Spatial.checkQueryEmptyIndex(TestSolr4Spatial.java:135)
[junit4:junit4] 2> at sun.reflect.NativeMethodAccessorImpl.invoke0(Native Method)
[junit4:junit4] 2> at sun.reflect.NativeMethodAccessorImpl.invoke(NativeMethodAccessorImpl.java:57)
[junit4:junit4] 2> at sun.reflect.DelegatingMethodAccessorImpl.invoke(DelegatingMethodAccessorImpl.java:43)
[junit4:junit4] 2> at java.lang.reflect.Method.invoke(Method.java:601)
[junit4:junit4] 2> at com.carrotsearch.randomizedtesting.RandomizedRunner.invoke(RandomizedRunner.java:1559)
[junit4:junit4] 2> at com.carrotsearch.randomizedtesting.RandomizedRunner.access$600(RandomizedRunner.java:79)
[junit4:junit4] 2> at com.carrotsearch.randomizedtesting.RandomizedRunner$6.evaluate(RandomizedRunner.java:737)
[junit4:junit4] 2> at com.carrotsearch.randomizedtesting.RandomizedRunner$7.evaluate(RandomizedRunner.java:773)
[junit4:junit4] 2> at com.carrotsearch.randomizedtesting.RandomizedRunner$8.evaluate(RandomizedRunner.java:787)
[junit4:junit4] 2> at com.carrotsearch.randomizedtesting.rules.SystemPropertiesRestoreRule$1.evaluate(SystemPropertiesRestoreRule.java:53)
[junit4:junit4] 2> at org.apache.lucene.util.TestRuleSetupTeardownChained$1.evaluate(TestRuleSetupTeardownChained.java:50)
[junit4:junit4] 2> at org.apache.lucene.util.TestRuleFieldCacheSanity$1.evaluate(TestRuleFieldCacheSanity.java:51)
[junit4:junit4] 2> at org.apache.lucene.util.AbstractBeforeAfterRule$1.evaluate(AbstractBeforeAfterRule.java:45)
[junit4:junit4] 2> at com.carrotsearch.randomizedtesting.rules.SystemPropertiesInvariantRule$1.evaluate(SystemPropertiesInvariantRule.java:55)
[junit4:junit4] 2> at org.apache.lucene.util.TestRuleThreadAndTestName$1.evaluate(TestRuleThreadAndTestName.java:48)
[junit4:junit4] 2> at org.apache.lucene.util.TestRuleIgnoreAfterMaxFailures$1.evaluate(TestRuleIgnoreAfterMaxFailures.java:70)
[junit4:junit4] 2> at org.apache.lucene.util.TestRuleMarkFailure$1.evaluate(TestRuleMarkFailure.java:48)
[junit4:junit4] 2> at com.carrotsearch.randomizedtesting.rules.StatementAdapter.evaluate(StatementAdapter.java:36)
[junit4:junit4] 2> at com.carrotsearch.randomizedtesting.ThreadLeakControl$StatementRunner.run(ThreadLeakControl.java:358)
[junit4:junit4] 2> at com.carrotsearch.randomizedtesting.ThreadLeakControl.forkTimeoutingTask(ThreadLeakControl.java:782)
[junit4:junit4] 2> at com.carrotsearch.randomizedtesting.ThreadLeakControl$3.evaluate(ThreadLeakControl.java:442)
[junit4:junit4] 2> at com.carrotsearch.randomizedtesting.RandomizedRunner.runSingleTest(RandomizedRunner.java:746)
[junit4:junit4] 2> at com.carrotsearch.randomizedtesting.RandomizedRunner$3.evaluate(RandomizedRunner.java:648)
[junit4:junit4] 2> at com.carrotsearch.randomizedtesting.RandomizedRunner$4.evaluate(RandomizedRunner.java:682)
[junit4:junit4] 2> at com.carrotsearch.randomizedtesting.RandomizedRunner$5.evaluate(RandomizedRunner.java:693)
[junit4:junit4] 2> at com.carrotsearch.randomizedtesting.rules.StatementAdapter.evaluate(StatementAdapter.java:36)
[junit4:junit4] 2> at com.carrotsearch.randomizedtesting.rules.SystemPropertiesRestoreRule$1.evaluate(SystemPropertiesRestoreRule.java:53)
[junit4:junit4] 2> at org.apache.lucene.util.AbstractBeforeAfterRule$1.evaluate(AbstractBeforeAfterRule.java:45)
[junit4:junit4] 2> at org.apache.lucene.util.TestRuleStoreClassName$1.evaluate(TestRuleStoreClassName.java:42)
[junit4:junit4] 2> at com.carrotsearch.randomizedtesting.rules.SystemPropertiesInvariantRule$1.evaluate(SystemPropertiesInvariantRule.java:55)
[junit4:junit4] 2> at com.carrotsearch.randomizedtesting.rules.NoShadowingOrOverridesOnMethodsRule$1.evaluate(NoShadowingOrOverridesOnMethodsRule.java:39)
[junit4:junit4] 2> at com.carrotsearch.randomizedtesting.rules.NoShadowingOrOverridesOnMethodsRule$1.evaluate(NoShadowingOrOverridesOnMethodsRule.java:39)
[junit4:junit4] 2> at com.carrotsearch.randomizedtesting.rules.StatementAdapter.evaluate(StatementAdapter.java:36)
[junit4:junit4] 2> at org.apache.lucene.util.TestRuleAssertionsRequired$1.evaluate(TestRuleAssertionsRequired.java:43)
[junit4:junit4] 2> at org.apache.lucene.util.TestRuleMarkFailure$1.evaluate(TestRuleMarkFailure.java:48)
[junit4:junit4] 2> at org.apache.lucene.util.TestRuleIgnoreAfterMaxFailures$1.evaluate(TestRuleIgnoreAfterMaxFailures.java:70)
[junit4:junit4] 2> at org.apache.lucene.util.TestRuleIgnoreTestSuites$1.evaluate(TestRuleIgnoreTestSuites.java:55)
[junit4:junit4] 2> at com.carrotsearch.randomizedtesting.rules.StatementAdapter.evaluate(StatementAdapter.java:36)
[junit4:junit4] 2> at com.carrotsearch.randomizedtesting.ThreadLeakControl$StatementRunner.run(ThreadLeakControl.java:358)
[junit4:junit4] 2> at java.lang.Thread.run(Thread.java:722)
[junit4:junit4] 2>
[junit4:junit4] 2> 1136 T2572 oas.SolrTestCaseJ4.tearDown ###Ending checkQueryEmptyIndex {p0=stqpt_geohash}
[junit4:junit4] 2> NOTE: reproduce with: ant test -Dtestcase=TestSolr4Spatial -Dtests.method="checkQueryEmptyIndex {p0=stqpt_geohash}" -Dtests.seed=A43ACD08EAE49210 -Dtests.multiplier=3 -Dtests.slow=true -Dtests.locale=es_CR -Dtests.timezone=Africa/Ndjamena -Dtests.file.encoding=UTF-8
[junit4:junit4] ERROR 0.02s J1 | TestSolr4Spatial.checkQueryEmptyIndex {p0=stqpt_geohash} <<<
[junit4:junit4] > Throwable #1: java.lang.RuntimeException: Exception during query
[junit4:junit4] > at __randomizedtesting.SeedInfo.seed([A43ACD08EAE49210:A4F046E521861550]:0)
[junit4:junit4] > at org.apache.solr.SolrTestCaseJ4.assertQ(SolrTestCaseJ4.java:503)
[junit4:junit4] > at org.apache.solr.SolrTestCaseJ4.assertQ(SolrTestCaseJ4.java:470)
[junit4:junit4] > at org.apache.solr.search.TestSolr4Spatial.checkHits(TestSolr4Spatial.java:170)
[junit4:junit4] > at org.apache.solr.search.TestSolr4Spatial.checkHits(TestSolr4Spatial.java:139)
[junit4:junit4] > at org.apache.solr.search.TestSolr4Spatial.checkQueryEmptyIndex(TestSolr4Spatial.java:135)
[junit4:junit4] > at sun.reflect.NativeMethodAccessorImpl.invoke0(Native Method)
[junit4:junit4] > at sun.reflect.NativeMethodAccessorImpl.invoke(NativeMethodAccessorImpl.java:57)
[junit4:junit4] > at sun.reflect.DelegatingMethodAccessorImpl.invoke(DelegatingMethodAccessorImpl.java:43)
[junit4:junit4] > at java.lang.reflect.Method.invoke(Method.java:601)
[junit4:junit4] > at com.carrotsearch.randomizedtesting.RandomizedRunner.invoke(RandomizedRunner.java:1559)
[junit4:junit4] > at com.carrotsearch.randomizedtesting.RandomizedRunner.access$600(RandomizedRunner.java:79)
[junit4:junit4] > at com.carrotsearch.randomizedtesting.RandomizedRunner$6.evaluate(RandomizedRunner.java:737)
[junit4:junit4] > at com.carrotsearch.randomizedtesting.RandomizedRunner$7.evaluate(RandomizedRunner.java:773)
[junit4:junit4] > at com.carrotsearch.randomizedtesting.RandomizedRunner$8.evaluate(RandomizedRunner.java:787)
[junit4:junit4] > at com.carrotsearch.randomizedtesting.rules.SystemPropertiesRestoreRule$1.evaluate(SystemPropertiesRestoreRule.java:53)
[junit4:junit4] > at org.apache.lucene.util.TestRuleSetupTeardownChained$1.evaluate(TestRuleSetupTeardownChained.java:50)
[junit4:junit4] > at org.apache.lucene.util.TestRuleFieldCacheSanity$1.evaluate(TestRuleFieldCacheSanity.java:51)
[junit4:junit4] > at org.apache.lucene.util.AbstractBeforeAfterRule$1.evaluate(AbstractBeforeAfterRule.java:45)
[junit4:junit4] > at com.carrotsearch.randomizedtesting.rules.SystemPropertiesInvariantRule$1.evaluate(SystemPropertiesInvariantRule.java:55)
[junit4:junit4] > at org.apache.lucene.util.TestRuleThreadAndTestName$1.evaluate(TestRuleThreadAndTestName.java:48)
[junit4:junit4] > at org.apache.lucene.util.TestRuleIgnoreAfterMaxFailures$1.evaluate(TestRuleIgnoreAfterMaxFailures.java:70)
[junit4:junit4] > at org.apache.lucene.util.TestRuleMarkFailure$1.evaluate(TestRuleMarkFailure.java:48)
[junit4:junit4] > at com.carrotsearch.randomizedtesting.rules.StatementAdapter.evaluate(StatementAdapter.java:36)
[junit4:junit4] > at com.carrotsearch.randomizedtesting.ThreadLeakControl$StatementRunner.run(ThreadLeakControl.java:358)
[junit4:junit4] > at com.carrotsearch.randomizedtesting.ThreadLeakControl.forkTimeoutingTask(ThreadLeakControl.java:782)
[junit4:junit4] > at com.carrotsearch.randomizedtesting.ThreadLeakControl$3.evaluate(ThreadLeakControl.java:442)
[junit4:junit4] > at com.carrotsearch.randomizedtesting.RandomizedRunner.runSingleTest(RandomizedRunner.java:746)
[junit4:junit4] > at com.carrotsearch.randomizedtesting.RandomizedRunner$3.evaluate(RandomizedRunner.java:648)
[junit4:junit4] > at com.carrotsearch.randomizedtesting.RandomizedRunner$4.evaluate(RandomizedRunner.java:682)
[junit4:junit4] > at com.carrotsearch.randomizedtesting.RandomizedRunner$5.evaluate(RandomizedRunner.java:693)
[junit4:junit4] > at com.carrotsearch.randomizedtesting.rules.StatementAdapter.evaluate(StatementAdapter.java:36)
[junit4:junit4] > at com.carrotsearch.randomizedtesting.rules.SystemPropertiesRestoreRule$1.evaluate(SystemPropertiesRestoreRule.java:53)
[junit4:junit4] > at org.apache.lucene.util.AbstractBeforeAfterRule$1.evaluate(AbstractBeforeAfterRule.java:45)
[junit4:junit4] > at org.apache.lucene.util.TestRuleStoreClassName$1.evaluate(TestRuleStoreClassName.java:42)
[junit4:junit4] > at com.carrotsearch.randomizedtesting.rules.SystemPropertiesInvariantRule$1.evaluate(SystemPropertiesInvariantRule.java:55)
[junit4:junit4] > at com.carrotsearch.randomizedtesting.rules.NoShadowingOrOverridesOnMethodsRule$1.evaluate(NoShadowingOrOverridesOnMethodsRule.java:39)
[junit4:junit4] > at com.carrotsearch.randomizedtesting.rules.NoShadowingOrOverridesOnMethodsRule$1.evaluate(NoShadowingOrOverridesOnMethodsRule.java:39)
[junit4:junit4] > at com.carrotsearch.randomizedtesting.rules.StatementAdapter.evaluate(StatementAdapter.java:36)
[junit4:junit4] > at org.apache.lucene.util.TestRuleAssertionsRequired$1.evaluate(TestRuleAssertionsRequired.java:43)
[junit4:junit4] > at org.apache.lucene.util.TestRuleMarkFailure$1.evaluate(TestRuleMarkFailure.java:48)
[junit4:junit4] > at org.apache.lucene.util.TestRuleIgnoreAfterMaxFailures$1.evaluate(TestRuleIgnoreAfterMaxFailures.java:70)
[junit4:junit4] > at org.apache.lucene.util.TestRuleIgnoreTestSuites$1.evaluate(TestRuleIgnoreTestSuites.java:55)
[junit4:junit4] > at com.carrotsearch.randomizedtesting.rules.StatementAdapter.evaluate(StatementAdapter.java:36)
[junit4:junit4] > at com.carrotsearch.randomizedtesting.ThreadLeakControl$StatementRunner.run(ThreadLeakControl.java:358)
[junit4:junit4] > at java.lang.Thread.run(Thread.java:722)
[junit4:junit4] > Caused by: java.lang.RuntimeException: REQUEST FAILED: xpath=*[count(//doc)=0]
[junit4:junit4] > xml response was: <?xml version="1.0" encoding="UTF-8"?>
[junit4:junit4] > <response>
[junit4:junit4] > <lst name="responseHeader"><int name="status">0</int><int name="QTime">10</int></lst><result name="response" numFound="3" start="0"><doc><str name="id">5</str></doc><doc><str name="id">6</str></doc><doc><str name="id">7</str></doc></result>
[junit4:junit4] > </response>
[junit4:junit4] >
[junit4:junit4] > request was:fl=id&q=*:*&fq={!field+f%3Dstqpt_geohash+score%3Dnone}Intersects(Circle(0,0+d%3D0.8993203677616635))&rows=1000
[junit4:junit4] > at org.apache.solr.SolrTestCaseJ4.assertQ(SolrTestCaseJ4.java:496)
[junit4:junit4] > ... 44 more
[junit4:junit4] 2> 1144 T2572 oas.SolrTestCaseJ4.setUp ###Starting testSort {p0=stqpt_geohash}
[junit4:junit4] 2> 1154 T2572 C190 oasu.DirectUpdateHandler2.deleteAll [collection1] REMOVING ALL DOCUMENTS FROM INDEX
[junit4:junit4] 2> 1154 T2572 C190 UPDATE [collection1] webapp=null path=null params={} {deleteByQuery=*:*} 0 0
[junit4:junit4] 2> 1157 T2572 C190 UPDATE [collection1] webapp=null path=null params={} {add=[100]} 0 0
[junit4:junit4] 2> 1160 T2572 C190 UPDATE [collection1] webapp=null path=null params={} {add=[101]} 0 0
[junit4:junit4] 2> 1162 T2572 C190 UPDATE [collection1] webapp=null path=null params={} {add=[999]} 0 0
[junit4:junit4] 2> 1165 T2572 C190 oasu.DirectUpdateHandler2.commit start commit{flags=0,_version_=0,optimize=false,openSearcher=true,waitSearcher=true,expungeDeletes=false,softCommit=false}
[junit4:junit4] 2> 1166 T2572 C190 oasc.SolrDeletionPolicy.onCommit SolrDeletionPolicy.onCommit: commits:num=2
[junit4:junit4] 2> commit{dir=MockDirWrapper(org.apache.lucene.store.RAMDirectory [at] 1983393 lockFactory=org.apache.lucene.store.NativeFSLockFactory [at] 21cf0b6),segFN=segments_g,generation=16,filenames=[._e_MockVariableIntBlock_0.doc, _e_MockVariableIntBlock_0.tii, _e.fdx, _e_TestBloomFilteredLucene40Postings_0.frq, segments_g, _e_nrm.cfe, _e_MockVariableIntBlock_0.tib, _e.si, _e_MockVariableIntBlock_0.skp, _e_TestBloomFilteredLucene40Postings_0.blm, _e.fdt, _e_nrm.cfs, _e_TestBloomFilteredLucene40Postings_0.tim, _e.fnm, _e_TestBloomFilteredLucene40Postings_0.tip]
[junit4:junit4] 2> commit{dir=MockDirWrapper(org.apache.lucene.store.RAMDirectory [at] 1983393 lockFactory=org.apache.lucene.store.NativeFSLockFactory [at] 21cf0b6),segFN=segments_h,generation=17,filenames=[._f_nrm.cfe, _f_MockVariableIntBlock_0.tib, _f_TestBloomFilteredLucene40Postings_0.tim, _f_TestBloomFilteredLucene40Postings_0.tip, _f_TestBloomFilteredLucene40Postings_0.frq, segments_h, _f.fdt, _f.si, _f.fdx, _f.fnm, _f_nrm.cfs, _f_TestBloomFilteredLucene40Postings_0.blm, _f_MockVariableIntBlock_0.doc, _f_MockVariableIntBlock_0.tii, _f_MockVariableIntBlock_0.skp]
[junit4:junit4] 2> 1167 T2572 C190 oasc.SolrDeletionPolicy.updateCommits newest commit = 17
[junit4:junit4] 2> 1168 T2572 C190 oass.SolrIndexSearcher.<init> Opening Searcher [at] 42f0a1f main
[junit4:junit4] 2> 1168 T2572 C190 oass.SolrIndexSearcher.getIndexDir WARNING WARNING: Directory impl does not support setting indexDir: org.apache.lucene.store.MockDirectoryWrapper
[junit4:junit4] 2> 1168 T2572 C190 oasu.DirectUpdateHandler2.commit end_commit_flush
[junit4:junit4] 2> 1168 T2573 oasc.SolrCore.registerSearcher [collection1] Registered new searcher Searcher [at] 42f0a1f main{StandardDirectoryReader(segments_h:52 _f(5.0):C3)}
[junit4:junit4] 2> 1169 T2572 C190 UPDATE [collection1] webapp=null path=null params={} {commit=} 0 4
[junit4:junit4] 2> 1184 T2572 C190 REQ [collection1] webapp=null path=null params={fl=id,score&q=stqpt_geohash:"Intersects(Circle(3,4+d%3D9))"} hits=2 status=0 QTime=14
[junit4:junit4] 2> 1198 T2572 C190 REQ [collection1] webapp=null path=null params={sort=score+asc&fl=id,score&q={!+score%3Ddistance}stqpt_geohash:"Intersects(Circle(3,4+d%3D9))"} hits=2 status=0 QTime=14
[junit4:junit4] 2> 1211 T2572 C190 REQ [collection1] webapp=null path=null params={sort=score+desc&fl=id,score&q={!+score%3DrecipDistance}stqpt_geohash:"Intersects(Circle(3,4+d%3D9))"} hits=2 status=0 QTime=12
[junit4:junit4] 2> 1224 T2572 C190 REQ [collection1] webapp=null path=null params={sort=score+asc&fl=id,score&q={!+score%3Ddistance}stqpt_geohash:"Intersects(Circle(4,0+d%3D9))"} hits=2 status=0 QTime=12
[junit4:junit4] 2> 1238 T2572 C190 REQ [collection1] webapp=null path=null params={sortQuery={!+score%3Ddistance}stqpt_geohash:"Intersects(Circle(3,4+d%3D9))"&sort=query($sortQuery)+asc&fl=id,score&q=-id:999} hits=2 status=0 QTime=13
[junit4:junit4] 2> 1252 T2572 C190 REQ [collection1] webapp=null path=null params={sortQuery={!+score%3Ddistance}stqpt_geohash:"Intersects(Circle(4,0+d%3D9))"&sort=query($sortQuery)+asc&fl=id,score&q=-id:999} hits=2 status=0 QTime=13
[junit4:junit4] 2> 1253 T2572 oas.SolrTestCaseJ4.tearDown ###Ending testSort {p0=stqpt_geohash}
[junit4:junit4] 2> 1256 T2572 oas.SolrTestCaseJ4.setUp ###Starting testIntersectFilter {p0=stqpt_geohash}
[junit4:junit4] 2> 1258 T2572 C190 oasu.DirectUpdateHandler2.deleteAll [collection1] REMOVING ALL DOCUMENTS FROM INDEX
[junit4:junit4] 2> 1258 T2572 C190 UPDATE [collection1] webapp=null path=null params={} {deleteByQuery=*:*} 0 0
[junit4:junit4] 2> 1261 T2572 C190 UPDATE [collection1] webapp=null path=null params={} {add=[1]} 0 0
[junit4:junit4] 2> 1263 T2572 C190 UPDATE [collection1] webapp=null path=null params={} {add=[2]} 0 0
[junit4:junit4] 2> 1266 T2572 C190 UPDATE [collection1] webapp=null path=null params={} {add=[3]} 0 0
[junit4:junit4] 2> 1274 T2572 C190 UPDATE [collection1] webapp=null path=null params={} {add=[4]} 0 0
[junit4:junit4] 2> 1277 T2572 C190 UPDATE [collection1] webapp=null path=null params={} {add=[5]} 0 0
[junit4:junit4] 2> 1280 T2572 C190 UPDATE [collection1] webapp=null path=null params={} {add=[6]} 0 1
[junit4:junit4] 2> 1282 T2572 C190 UPDATE [collection1] webapp=null path=null params={} {add=[7]} 0 0
[junit4:junit4] 2> 1285 T2572 C190 UPDATE [collection1] webapp=null path=null params={} {add=[8]} 0 1
[junit4:junit4] 2> 1287 T2572 C190 UPDATE [collection1] webapp=null path=null params={} {add=[9]} 0 0
[junit4:junit4] 2> 1290 T2572 C190 UPDATE [collection1] webapp=null path=null params={} {add=[10]} 0 1
[junit4:junit4] 2> 1292 T2572 C190 UPDATE [collection1] webapp=null path=null params={} {add=[11]} 0 0
[junit4:junit4] 2> 1294 T2572 C190 UPDATE [collection1] webapp=null path=null params={} {add=[12]} 0 0
[junit4:junit4] 2> 1297 T2572 C190 UPDATE [collection1] webapp=null path=null params={} {add=[13]} 0 0
[junit4:junit4] 2> 1299 T2572 C190 oasu.DirectUpdateHandler2.commit start commit{flags=0,_version_=0,optimize=false,openSearcher=true,waitSearcher=true,expungeDeletes=false,softCommit=false}
[junit4:junit4] 2> 1301 T2572 C190 oasc.SolrDeletionPolicy.onCommit SolrDeletionPolicy.onCommit: commits:num=2
[junit4:junit4] 2> commit{dir=MockDirWrapper(org.apache.lucene.store.RAMDirectory [at] 1983393 lockFactory=org.apache.lucene.store.NativeFSLockFactory [at] 21cf0b6),segFN=segments_h,generation=17,filenames=[._f_nrm.cfe, _f_MockVariableIntBlock_0.tib, _f_TestBloomFilteredLucene40Postings_0.tim, _f_TestBloomFilteredLucene40Postings_0.tip, _f_TestBloomFilteredLucene40Postings_0.frq, segments_h, _f.fdt, _f.si, _f.fdx, _f.fnm, _f_nrm.cfs, _f_TestBloomFilteredLucene40Postings_0.blm, _f_MockVariableIntBlock_0.doc, _f_MockVariableIntBlock_0.tii, _f_MockVariableIntBlock_0.skp]
[junit4:junit4] 2> commit{dir=MockDirWrapper(org.apache.lucene.store.RAMDirectory [at] 1983393 lockFactory=org.apache.lucene.store.NativeFSLockFactory [at] 21cf0b6),segFN=segments_i,generation=18,filenames=[._g.fdt, _g.si, _g_MockVariableIntBlock_0.skp, _g_nrm.cfs, _g.fdx, _g_TestBloomFilteredLucene40Postings_0.frq, _g_TestBloomFilteredLucene40Postings_0.tim, segments_i, _g_MockVariableIntBlock_0.tib, _g_TestBloomFilteredLucene40Postings_0.tip, _g.fnm, _g_MockVariableIntBlock_0.tii, _g_MockVariableIntBlock_0.doc, _g_nrm.cfe, _g_TestBloomFilteredLucene40Postings_0.blm]
[junit4:junit4] 2> 1301 T2572 C190 oasc.SolrDeletionPolicy.updateCommits newest commit = 18
[junit4:junit4] 2> 1302 T2572 C190 oass.SolrIndexSearcher.<init> Opening Searcher [at] 2715945 main
[junit4:junit4] 2> 1302 T2572 C190 oass.SolrIndexSearcher.getIndexDir WARNING WARNING: Directory impl does not support setting indexDir: org.apache.lucene.store.MockDirectoryWrapper
[junit4:junit4] 2> 1303 T2572 C190 oasu.DirectUpdateHandler2.commit end_commit_flush
[junit4:junit4] 2> 1303 T2573 oasc.SolrCore.registerSearcher [collection1] Registered new searcher Searcher [at] 2715945 main{StandardDirectoryReader(segments_i:55 _g(5.0):C13)}
[junit4:junit4] 2> 1303 T2572 C190 UPDATE [collection1] webapp=null path=null params={} {commit=} 0 4
[junit4:junit4] 2> 1308 T2572 C190 REQ [collection1] webapp=null path=null params={fl=id&q=*:*&fq={!field+f%3Dstqpt_geohash+score%3Dnone}Intersects(Circle(1,1+d%3D1.5738106435829113))&rows=1000} hits=3 status=0 QTime=4
[junit4:junit4] 2> 1315 T2572 C190 REQ [collection1] webapp=null path=null params={fl=id&q=*:*&fq={!field+f%3Dstqpt_geohash+score%3Dnone}Intersects(Circle(0,179.8+d%3D1.798640735523327))&rows=1000} hits=2 status=0 QTime=5
[junit4:junit4] 2> 2153 T2572 C190 REQ [collection1] webapp=null path=null params={fl=id&q=*:*&fq={!field+f%3Dstqpt_geohash+score%3Ddistance}Intersects(Circle(89.8,50+d%3D1.798640735523327))&rows=1000} hits=2 status=0 QTime=836
[junit4:junit4] 2> 2953 T2572 C190 REQ [collection1] webapp=null path=null params={fl=id&q=*:*&fq={!field+f%3Dstqpt_geohash}Intersects(Circle(-89.8,50+d%3D1.798640735523327))&rows=1000} hits=2 status=0 QTime=798
[junit4:junit4] 2> 2961 T2572 C190 REQ [collection1] webapp=null path=null params={fl=id&q=*:*&fq={!field+f%3Dstqpt_geohash+score%3DrecipDistance}Intersects(Circle(33.0,-80.0+d%3D2.6979611032849906))&rows=1000} hits=2 status=0 QTime=6
[junit4:junit4] 2> 2964 T2572 C190 REQ [collection1] webapp=null path=null params={fl=id&q=*:*&fq={!field+f%3Dstqpt_geohash}Intersects(Circle(1,1+d%3D44.96601838808318))&rows=1000} hits=3 status=0 QTime=2
[junit4:junit4] 2> 2973 T2572 C190 REQ [collection1] webapp=null path=null params={fl=id&q=*:*&fq={!field+f%3Dstqpt_geohash+score%3Dnone}Intersects(-0.034898+-0.034898+0.234898+0.234898)&rows=1000} hits=2 status=0 QTime=6
[junit4:junit4] 2> 2977 T2572 C190 oasu.DirectUpdateHandler2.deleteAll [collection1] REMOVING ALL DOCUMENTS FROM INDEX
[junit4:junit4] 2> 2977 T2572 C190 UPDATE [collection1] webapp=null path=null params={} {deleteByQuery=*:*} 0 0
[junit4:junit4] 2> 3045 T2572 C190 UPDATE [collection1] webapp=null path=null params={} {add=[14]} 0 0
[junit4:junit4] 2> 3048 T2572 C190 UPDATE [collection1] webapp=null path=null params={} {add=[15]} 0 0
[junit4:junit4] 2> 3051 T2572 C190 UPDATE [collection1] webapp=null path=null params={} {add=[16]} 0 0
[junit4:junit4] 2> 3053 T2572 C190 UPDATE [collection1] webapp=null path=null params={} {add=[17]} 0 0
[junit4:junit4] 2> 3056 T2572 C190 oasu.DirectUpdateHandler2.commit start commit{flags=0,_version_=0,optimize=false,openSearcher=true,waitSearcher=true,expungeDeletes=false,softCommit=false}
[junit4:junit4] 2> 3057 T2572 C190 oasc.SolrDeletionPolicy.onCommit SolrDeletionPolicy.onCommit: commits:num=2
[junit4:junit4] 2> commit{dir=MockDirWrapper(org.apache.lucene.store.RAMDirectory [at] 1983393 lockFactory=org.apache.lucene.store.NativeFSLockFactory [at] 21cf0b6),segFN=segments_i,generation=18,filenames=[._g.fdt, _g.si, _g_MockVariableIntBlock_0.skp, _g_nrm.cfs, _g.fdx, _g_TestBloomFilteredLucene40Postings_0.frq, _g_TestBloomFilteredLucene40Postings_0.tim, segments_i, _g_MockVariableIntBlock_0.tib, _g_TestBloomFilteredLucene40Postings_0.tip, _g.fnm, _g_MockVariableIntBlock_0.tii, _g_MockVariableIntBlock_0.doc, _g_nrm.cfe, _g_TestBloomFilteredLucene40Postings_0.blm]
[junit4:junit4] 2> commit{dir=MockDirWrapper(org.apache.lucene.store.RAMDirectory [at] 1983393 lockFactory=org.apache.lucene.store.NativeFSLockFactory [at] 21cf0b6),segFN=segments_j,generation=19,filenames=[._h_MockVariableIntBlock_0.tii, _h.fnm, _h.fdt, _h_TestBloomFilteredLucene40Postings_0.frq, _h_MockVariableIntBlock_0.skp, _h_MockVariableIntBlock_0.doc, _h.si, _h.fdx, _h_nrm.cfe, _h_nrm.cfs, _h_MockVariableIntBlock_0.tib, _h_TestBloomFilteredLucene40Postings_0.tim, segments_j, _h_TestBloomFilteredLucene40Postings_0.blm, _h_TestBloomFilteredLucene40Postings_0.tip]
[junit4:junit4] 2> 3057 T2572 C190 oasc.SolrDeletionPolicy.updateCommits newest commit = 19
[junit4:junit4] 2> 3058 T2572 C190 oass.SolrIndexSearcher.<init> Opening Searcher [at] 346525c main
[junit4:junit4] 2> 3059 T2572 C190 oass.SolrIndexSearcher.getIndexDir WARNING WARNING: Directory impl does not support setting indexDir: org.apache.lucene.store.MockDirectoryWrapper
[junit4:junit4] 2> 3059 T2573 oasc.SolrCore.registerSearcher [collection1] Registered new searcher Searcher [at] 346525c main{StandardDirectoryReader(segments_j:58 _h(5.0):C4)}
[junit4:junit4] 2> 3059 T2572 C190 oasu.DirectUpdateHandler2.commit end_commit_flush
[junit4:junit4] 2> 3060 T2572 C190 UPDATE [collection1] webapp=null path=null params={} {commit=} 0 4
[junit4:junit4] 2> 3073 T2572 C190 REQ [collection1] webapp=null path=null params={fl=id&q=*:*&fq={!field+f%3Dstqpt_geohash+score%3Ddistance}Intersects(Circle(0,0+d%3D8.993203677616636))&rows=1000} hits=1 status=0 QTime=12
[junit4:junit4] 2> 3079 T2572 C190 REQ [collection1] webapp=null path=null params={fl=id&q=*:*&fq={!field+f%3Dstqpt_geohash}Intersects(Circle(0,0+d%3D17.986407355233272))&rows=1000} hits=2 status=0 QTime=4
[junit4:junit4] 2> 3085 T2572 C190 REQ [collection1] webapp=null path=null params={fl=id&q=*:*&fq={!field+f%3Dstqpt_geohash+score%3Ddistance}Intersects(-26.979611+-26.979611+26.979611+26.979611)&rows=1000} hits=3 status=0 QTime=3
[junit4:junit4] 2> 3094 T2572 C190 REQ [collection1] webapp=null path=null params={fl=id&q=*:*&fq={!field+f%3Dstqpt_geohash}Intersects(Circle(0,0+d%3D26.98860423652752))&rows=1000} hits=3 status=0 QTime=6
[junit4:junit4] 2> 3104 T2572 C190 REQ [collection1] webapp=null path=null params={fl=id&q=*:*&fq={!field+f%3Dstqpt_geohash}Intersects(Circle(0,0+d%3D26.980510353217664))&rows=1000} hits=3 status=0 QTime=7
[junit4:junit4] 2> 3115 T2572 C190 REQ [collection1] webapp=null path=null params={fl=id&q=*:*&fq={!field+f%3Dstqpt_geohash}Intersects(Circle(43.517030,-96.789603+d%3D0.9802592008602133))&rows=1000} hits=0 status=0 QTime=8
[junit4:junit4] 2> 3125 T2572 C190 REQ [collection1] webapp=null path=null params={fl=id&q=*:*&fq={!field+f%3Dstqpt_geohash+score%3Ddistance}Intersects(Circle(43.517030,-96.789603+d%3D0.9892524045378299))&rows=1000} hits=0 status=0 QTime=8
[junit4:junit4] 2> 3133 T2572 C190 REQ [collection1] webapp=null path=null params={fl=id&q=*:*&fq={!field+f%3Dstqpt_geohash+score%3Dnone}Intersects(-98.153831+42.527778+-95.425375+44.506282)&rows=1000} hits=1 status=0 QTime=7
[junit4:junit4] 2> 3134 T2572 oas.SolrTestCaseJ4.tearDown ###Ending testIntersectFilter {p0=stqpt_geohash}
[junit4:junit4] 2> 3137 T2572 oas.SolrTestCaseJ4.setUp ###Starting testSortMultiVal {p0=twodoubles}
[junit4:junit4] 2> 3150 T2572 C190 oasu.DirectUpdateHandler2.deleteAll [collection1] REMOVING ALL DOCUMENTS FROM INDEX
[junit4:junit4] 2> 3150 T2572 C190 UPDATE [collection1] webapp=null path=null params={} {deleteByQuery=*:*} 0 0
[junit4:junit4] 2> 3152 T2572 oas.SolrTestCaseJ4.tearDown ###Ending testSortMultiVal {p0=twodoubles}
[junit4:junit4] IGNOR/A 0.03s J1 | TestSolr4Spatial.testSortMultiVal {p0=twodoubles}
[junit4:junit4] > Assumption #1: Multivalue not supported for this field
[junit4:junit4] 2> 3164 T2572 oas.SolrTestCaseJ4.setUp ###Starting checkResultFormat {p0=twodoubles}
[junit4:junit4] 2> 3166 T2572 C190 oasu.DirectUpdateHandler2.deleteAll [collection1] REMOVING ALL DOCUMENTS FROM INDEX
[junit4:junit4] 2> 3166 T2572 C190 UPDATE [collection1] webapp=null path=null params={} {deleteByQuery=*:*} 0 0
[junit4:junit4] 2> 3173 T2572 C190 UPDATE [collection1] webapp=null path=null params={} {add=[11]} 0 4
[junit4:junit4] 2> 3175 T2572 C190 oasu.DirectUpdateHandler2.commit start commit{flags=0,_version_=0,optimize=false,openSearcher=true,waitSearcher=true,expungeDeletes=false,softCommit=false}
[junit4:junit4] 2> 3176 T2572 C190 oasc.SolrDeletionPolicy.onCommit SolrDeletionPolicy.onCommit: commits:num=2
[junit4:junit4] 2> commit{dir=MockDirWrapper(org.apache.lucene.store.RAMDirectory [at] 1983393 lockFactory=org.apache.lucene.store.NativeFSLockFactory [at] 21cf0b6),segFN=segments_j,generation=19,filenames=[._h_MockVariableIntBlock_0.tii, _h.fnm, _h.fdt, _h_TestBloomFilteredLucene40Postings_0.frq, _h_MockVariableIntBlock_0.skp, _h_MockVariableIntBlock_0.doc, _h.si, _h.fdx, _h_nrm.cfe, _h_nrm.cfs, _h_MockVariableIntBlock_0.tib, _h_TestBloomFilteredLucene40Postings_0.tim, segments_j, _h_TestBloomFilteredLucene40Postings_0.blm, _h_TestBloomFilteredLucene40Postings_0.tip]
[junit4:junit4] 2> commit{dir=MockDirWrapper(org.apache.lucene.store.RAMDirectory [at] 1983393 lockFactory=org.apache.lucene.store.NativeFSLockFactory [at] 21cf0b6),segFN=segments_k,generation=20,filenames=[._i_MockRandom_0.doc, _i_MockRandom_0.tib, segments_k, _i_MockVariableIntBlock_0.tii, _i.si, _i_MockVariableIntBlock_0.doc, _i_nrm.cfe, _i_nrm.cfs, _i_MockRandom_0.tiv, _i_MockVariableIntBlock_0.tib, _i_MockRandom_0.sd, _i.fdx, _i_MockVariableIntBlock_0.skp, _i.fnm, _i.fdt, _i_MockRandom_0.skp]
[junit4:junit4] 2> 3177 T2572 C190 oasc.SolrDeletionPolicy.updateCommits newest commit = 20
[junit4:junit4] 2> 3178 T2572 C190 oass.SolrIndexSearcher.<init> Opening Searcher [at] 21d3a2a main
[junit4:junit4] 2> 3178 T2572 C190 oass.SolrIndexSearcher.getIndexDir WARNING WARNING: Directory impl does not support setting indexDir: org.apache.lucene.store.MockDirectoryWrapper
[junit4:junit4] 2> 3178 T2572 C190 oasu.DirectUpdateHandler2.commit end_commit_flush
[junit4:junit4] 2> 3178 T2573 oasc.SolrCore.registerSearcher [collection1] Registered new searcher Searcher [at] 21d3a2a main{StandardDirectoryReader(segments_k:62 _i(5.0):C1)}
[junit4:junit4] 2> 3179 T2572 C190 UPDATE [collection1] webapp=null path=null params={} {commit=} 0 4
[junit4:junit4] 2> 3184 T2572 C190 REQ [collection1] webapp=null path=null params={fl=id,twodoubles&q=*:*&fq={!field+needScore%3Dfalse+f%3Dtwodoubles}Intersects(Circle(89.9,-130+d%3D9))&rows=1000} hits=1 status=0 QTime=4
[junit4:junit4] 2> 3185 T2572 oas.SolrTestCaseJ4.tearDown ###Ending checkResultFormat {p0=twodoubles}
[junit4:junit4] 2> 3189 T2572 oas.SolrTestCaseJ4.setUp ###Starting testRangeSyntax {p0=twodoubles}
[junit4:junit4] 2> 3190 T2572 C190 oasu.DirectUpdateHandler2.deleteAll [collection1] REMOVING ALL DOCUMENTS FROM INDEX
[junit4:junit4] 2> 3191 T2572 C190 UPDATE [collection1] webapp=null path=null params={} {deleteByQuery=*:*} 0 1
[junit4:junit4] 2> 3194 T2572 C190 UPDATE [collection1] webapp=null path=null params={} {add=[1]} 0 1
[junit4:junit4] 2> 3196 T2572 C190 UPDATE [collection1] webapp=null path=null params={} {add=[2]} 0 0
[junit4:junit4] 2> 3198 T2572 C190 UPDATE [collection1] webapp=null path=null params={} {add=[3]} 0 0
[junit4:junit4] 2> 3201 T2572 C190 UPDATE [collection1] webapp=null path=null params={} {add=[4]} 0 0
[junit4:junit4] 2> 3203 T2572 C190 UPDATE [collection1] webapp=null path=null params={} {add=[5]} 0 0
[junit4:junit4] 2> 3206 T2572 C190 UPDATE [collection1] webapp=null path=null params={} {add=[6]} 0 0
[junit4:junit4] 2> 3208 T2572 C190 UPDATE [collection1] webapp=null path=null params={} {add=[7]} 0 0
[junit4:junit4] 2> 3211 T2572 C190 UPDATE [collection1] webapp=null path=null params={} {add=[8]} 0 0
[junit4:junit4] 2> 3213 T2572 C190 UPDATE [collection1] webapp=null path=null params={} {add=[9]} 0 0
[junit4:junit4] 2> 3216 T2572 C190 UPDATE [collection1] webapp=null path=null params={} {add=[10]} 0 1
[junit4:junit4] 2> 3218 T2572 C190 UPDATE [collection1] webapp=null path=null params={} {add=[11]} 0 0
[junit4:junit4] 2> 3221 T2572 C190 UPDATE [collection1] webapp=null path=null params={} {add=[12]} 0 1
[junit4:junit4] 2> 3223 T2572 C190 UPDATE [collection1] webapp=null path=null params={} {add=[13]} 0 0
[junit4:junit4] 2> 3232 T2572 C190 oasu.DirectUpdateHandler2.commit start commit{flags=0,_version_=0,optimize=false,openSearcher=true,waitSearcher=true,expungeDeletes=false,softCommit=false}
[junit4:junit4] 2> 3233 T2572 C190 oasc.SolrDeletionPolicy.onCommit SolrDeletionPolicy.onCommit: commits:num=2
[junit4:junit4] 2> commit{dir=MockDirWrapper(org.apache.lucene.store.RAMDirectory [at] 1983393 lockFactory=org.apache.lucene.store.NativeFSLockFactory [at] 21cf0b6),segFN=segments_k,generation=20,filenames=[._i_MockRandom_0.doc, _i_MockRandom_0.tib, segments_k, _i_MockVariableIntBlock_0.tii, _i.si, _i_MockVariableIntBlock_0.doc, _i_nrm.cfe, _i_nrm.cfs, _i_MockRandom_0.tiv, _i_MockVariableIntBlock_0.tib, _i_MockRandom_0.sd, _i.fdx, _i_MockVariableIntBlock_0.skp, _i.fnm, _i.fdt, _i_MockRandom_0.skp]
[junit4:junit4] 2> commit{dir=MockDirWrapper(org.apache.lucene.store.RAMDirectory [at] 1983393 lockFactory=org.apache.lucene.store.NativeFSLockFactory [at] 21cf0b6),segFN=segments_l,generation=21,filenames=[._j.fdx, _j.si, _j_nrm.cfe, _j_MockVariableIntBlock_0.skp, _j.fdt, _j_MockRandom_0.tip, _j.fnm, _j_MockRandom_0.tim, _j_MockRandom_0.skp, _j_MockRandom_0.sd, _j_MockVariableIntBlock_0.tii, _j_MockRandom_0.doc, segments_l, _j_nrm.cfs, _j_MockVariableIntBlock_0.tib, _j_MockVariableIntBlock_0.doc]
[junit4:junit4] 2> 3234 T2572 C190 oasc.SolrDeletionPolicy.updateCommits newest commit = 21
[junit4:junit4] 2> 3235 T2572 C190 oass.SolrIndexSearcher.<init> Opening Searcher [at] 5eb4511 main
[junit4:junit4] 2> 3235 T2572 C190 oass.SolrIndexSearcher.getIndexDir WARNING WARNING: Directory impl does not support setting indexDir: org.apache.lucene.store.MockDirectoryWrapper
[junit4:junit4] 2> 3235 T2573 oasc.SolrCore.registerSearcher [collection1] Registered new searcher Searcher [at] 5eb4511 main{StandardDirectoryReader(segments_l:65 _j(5.0):C13)}
[junit4:junit4] 2> 3235 T2572 C190 oasu.DirectUpdateHandler2.commit end_commit_flush
[junit4:junit4] 2> 3236 T2572 C190 UPDATE [collection1] webapp=null path=null params={} {commit=} 0 5
[junit4:junit4] 2> 3237 T2572 C190 REQ [collection1] webapp=null path=null params={fl=id&q=*:*&fq={!+needScore%3Dtrue+df%3Dtwodoubles}[32,-80+TO+33,-79]&rows=1000} hits=1 status=0 QTime=0
[junit4:junit4] 2> 3239 T2572 oas.SolrTestCaseJ4.tearDown ###Ending testRangeSyntax {p0=twodoubles}
[junit4:junit4] 2> 3242 T2572 oas.SolrTestCaseJ4.setUp ###Starting checkQueryEmptyIndex {p0=twodoubles}
[junit4:junit4] 2> 3244 T2572 C190 oasu.DirectUpdateHandler2.deleteAll [collection1] REMOVING ALL DOCUMENTS FROM INDEX
[junit4:junit4] 2> 3244 T2572 C190 UPDATE [collection1] webapp=null path=null params={} {deleteByQuery=*:*} 0 0
[junit4:junit4] 2> 3246 T2572 C190 REQ [collection1] webapp=null path=null params={fl=id&q=*:*&fq={!field+f%3Dtwodoubles+score%3Dnone}Intersects(Circle(0,0+d%3D0.8993203677616635))&rows=1000} hits=3 status=0 QTime=1
[junit4:junit4] 2> 3247 T2572 oas.SolrTestCaseJ4.assertQ SEVERE REQUEST FAILED: xpath=*[count(//doc)=0]
[junit4:junit4] 2> xml response was: <?xml version="1.0" encoding="UTF-8"?>
[junit4:junit4] 2> <response>
[junit4:junit4] 2> <lst name="responseHeader"><int name="status">0</int><int name="QTime">1</int></lst><result name="response" numFound="3" start="0"><doc><str name="id">5</str></doc><doc><str name="id">6</str></doc><doc><str name="id">7</str></doc></result>
[junit4:junit4] 2> </response>
[junit4:junit4] 2>
[junit4:junit4] 2> request was:fl=id&q=*:*&fq={!field+f%3Dtwodoubles+score%3Dnone}Intersects(Circle(0,0+d%3D0.8993203677616635))&rows=1000
[junit4:junit4] 2> 3247 T2572 oasc.SolrException.log SEVERE REQUEST FAILED: fl=id&q=*:*&fq={!field+f%3Dtwodoubles+score%3Dnone}Intersects(Circle(0,0+d%3D0.8993203677616635))&rows=1000:java.lang.RuntimeException: REQUEST FAILED: xpath=*[count(//doc)=0]
[junit4:junit4] 2> xml response was: <?xml version="1.0" encoding="UTF-8"?>
[junit4:junit4] 2> <response>
[junit4:junit4] 2> <lst name="responseHeader"><int name="status">0</int><int name="QTime">1</int></lst><result name="response" numFound="3" start="0"><doc><str name="id">5</str></doc><doc><str name="id">6</str></doc><doc><str name="id">7</str></doc></result>
[junit4:junit4] 2> </response>
[junit4:junit4] 2>
[junit4:junit4] 2> request was:fl=id&q=*:*&fq={!field+f%3Dtwodoubles+score%3Dnone}Intersects(Circle(0,0+d%3D0.8993203677616635))&rows=1000
[junit4:junit4] 2> at org.apache.solr.SolrTestCaseJ4.assertQ(SolrTestCaseJ4.java:496)
[junit4:junit4] 2> at org.apache.solr.SolrTestCaseJ4.assertQ(SolrTestCaseJ4.java:470)
[junit4:junit4] 2> at org.apache.solr.search.TestSolr4Spatial.checkHits(TestSolr4Spatial.java:170)
[junit4:junit4] 2> at org.apache.solr.search.TestSolr4Spatial.checkHits(TestSolr4Spatial.java:139)
[junit4:junit4] 2> at org.apache.solr.search.TestSolr4Spatial.checkQueryEmptyIndex(TestSolr4Spatial.java:135)
[junit4:junit4] 2> at sun.reflect.NativeMethodAccessorImpl.invoke0(Native Method)
[junit4:junit4] 2> at sun.reflect.NativeMethodAccessorImpl.invoke(NativeMethodAccessorImpl.java:57)
[junit4:junit4] 2> at sun.reflect.DelegatingMethodAccessorImpl.invoke(DelegatingMethodAccessorImpl.java:43)
[junit4:junit4] 2> at java.lang.reflect.Method.invoke(Method.java:601)
[junit4:junit4] 2> at com.carrotsearch.randomizedtesting.RandomizedRunner.invoke(RandomizedRunner.java:1559)
[junit4:junit4] 2> at com.carrotsearch.randomizedtesting.RandomizedRunner.access$600(RandomizedRunner.java:79)
[junit4:junit4] 2> at com.carrotsearch.randomizedtesting.RandomizedRunner$6.evaluate(RandomizedRunner.java:737)
[junit4:junit4] 2> at com.carrotsearch.randomizedtesting.RandomizedRunner$7.evaluate(RandomizedRunner.java:773)
[junit4:junit4] 2> at com.carrotsearch.randomizedtesting.RandomizedRunner$8.evaluate(RandomizedRunner.java:787)
[junit4:junit4] 2> at com.carrotsearch.randomizedtesting.rules.SystemPropertiesRestoreRule$1.evaluate(SystemPropertiesRestoreRule.java:53)
[junit4:junit4] 2> at org.apache.lucene.util.TestRuleSetupTeardownChained$1.evaluate(TestRuleSetupTeardownChained.java:50)
[junit4:junit4] 2> at org.apache.lucene.util.TestRuleFieldCacheSanity$1.evaluate(TestRuleFieldCacheSanity.java:51)
[junit4:junit4] 2> at org.apache.lucene.util.AbstractBeforeAfterRule$1.evaluate(AbstractBeforeAfterRule.java:45)
[junit4:junit4] 2> at com.carrotsearch.randomizedtesting.rules.SystemPropertiesInvariantRule$1.evaluate(SystemPropertiesInvariantRule.java:55)
[junit4:junit4] 2> at org.apache.lucene.util.TestRuleThreadAndTestName$1.evaluate(TestRuleThreadAndTestName.java:48)
[junit4:junit4] 2> at org.apache.lucene.util.TestRuleIgnoreAfterMaxFailures$1.evaluate(TestRuleIgnoreAfterMaxFailures.java:70)
[junit4:junit4] 2> at org.apache.lucene.util.TestRuleMarkFailure$1.evaluate(TestRuleMarkFailure.java:48)
[junit4:junit4] 2> at com.carrotsearch.randomizedtesting.rules.StatementAdapter.evaluate(StatementAdapter.java:36)
[junit4:junit4] 2> at com.carrotsearch.randomizedtesting.ThreadLeakControl$StatementRunner.run(ThreadLeakControl.java:358)
[junit4:junit4] 2> at com.carrotsearch.randomizedtesting.ThreadLeakControl.forkTimeoutingTask(ThreadLeakControl.java:782)
[junit4:junit4] 2> at com.carrotsearch.randomizedtesting.ThreadLeakControl$3.evaluate(ThreadLeakControl.java:442)
[junit4:junit4] 2> at com.carrotsearch.randomizedtesting.RandomizedRunner.runSingleTest(RandomizedRunner.java:746)
[junit4:junit4] 2> at com.carrotsearch.randomizedtesting.RandomizedRunner$3.evaluate(RandomizedRunner.java:648)
[junit4:junit4] 2> at com.carrotsearch.randomizedtesting.RandomizedRunner$4.evaluate(RandomizedRunner.java:682)
[junit4:junit4] 2> at com.carrotsearch.randomizedtesting.RandomizedRunner$5.evaluate(RandomizedRunner.java:693)
[junit4:junit4] 2> at com.carrotsearch.randomizedtesting.rules.StatementAdapter.evaluate(StatementAdapter.java:36)
[junit4:junit4] 2> at com.carrotsearch.randomizedtesting.rules.SystemPropertiesRestoreRule$1.evaluate(SystemPropertiesRestoreRule.java:53)
[junit4:junit4] 2> at org.apache.lucene.util.AbstractBeforeAfterRule$1.evaluate(AbstractBeforeAfterRule.java:45)
[junit4:junit4] 2> at org.apache.lucene.util.TestRuleStoreClassName$1.evaluate(TestRuleStoreClassName.java:42)
[junit4:junit4] 2> at com.carrotsearch.randomizedtesting.rules.SystemPropertiesInvariantRule$1.evaluate(SystemPropertiesInvariantRule.java:55)
[junit4:junit4] 2> at com.carrotsearch.randomizedtesting.rules.NoShadowingOrOverridesOnMethodsRule$1.evaluate(NoShadowingOrOverridesOnMethodsRule.java:39)
[junit4:junit4] 2> at com.carrotsearch.randomizedtesting.rules.NoShadowingOrOverridesOnMethodsRule$1.evaluate(NoShadowingOrOverridesOnMethodsRule.java:39)
[junit4:junit4] 2> at com.carrotsearch.randomizedtesting.rules.StatementAdapter.evaluate(StatementAdapter.java:36)
[junit4:junit4] 2> at org.apache.lucene.util.TestRuleAssertionsRequired$1.evaluate(TestRuleAssertionsRequired.java:43)
[junit4:junit4] 2> at org.apache.lucene.util.TestRuleMarkFailure$1.evaluate(TestRuleMarkFailure.java:48)
[junit4:junit4] 2> at org.apache.lucene.util.TestRuleIgnoreAfterMaxFailures$1.evaluate(TestRuleIgnoreAfterMaxFailures.java:70)
[junit4:junit4] 2> at org.apache.lucene.util.TestRuleIgnoreTestSuites$1.evaluate(TestRuleIgnoreTestSuites.java:55)
[junit4:junit4] 2> at com.carrotsearch.randomizedtesting.rules.StatementAdapter.evaluate(StatementAdapter.java:36)
[junit4:junit4] 2> at com.carrotsearch.randomizedtesting.ThreadLeakControl$StatementRunner.run(ThreadLeakControl.java:358)
[junit4:junit4] 2> at java.lang.Thread.run(Thread.java:722)
[junit4:junit4] 2>
[junit4:junit4] 2> 3248 T2572 oas.SolrTestCaseJ4.tearDown ###Ending checkQueryEmptyIndex {p0=twodoubles}
[junit4:junit4] 2> NOTE: reproduce with: ant test -Dtestcase=TestSolr4Spatial -Dtests.method="checkQueryEmptyIndex {p0=twodoubles}" -Dtests.seed=A43ACD08EAE49210 -Dtests.multiplier=3 -Dtests.slow=true -Dtests.locale=es_CR -Dtests.timezone=Africa/Ndjamena -Dtests.file.encoding=UTF-8
[junit4:junit4] ERROR 0.01s J1 | TestSolr4Spatial.checkQueryEmptyIndex {p0=twodoubles} <<<
[junit4:junit4] > Throwable #1: java.lang.RuntimeException: Exception during query
[junit4:junit4] > at __randomizedtesting.SeedInfo.seed([A43ACD08EAE49210:A4F046E521861550]:0)
[junit4:junit4] > at org.apache.solr.SolrTestCaseJ4.assertQ(SolrTestCaseJ4.java:503)
[junit4:junit4] > at org.apache.solr.SolrTestCaseJ4.assertQ(SolrTestCaseJ4.java:470)
[junit4:junit4] > at org.apache.solr.search.TestSolr4Spatial.checkHits(TestSolr4Spatial.java:170)
[junit4:junit4] > at org.apache.solr.search.TestSolr4Spatial.checkHits(TestSolr4Spatial.java:139)
[junit4:junit4] > at org.apache.solr.search.TestSolr4Spatial.checkQueryEmptyIndex(TestSolr4Spatial.java:135)
[junit4:junit4] > at sun.reflect.NativeMethodAccessorImpl.invoke0(Native Method)
[junit4:junit4] > at sun.reflect.NativeMethodAccessorImpl.invoke(NativeMethodAccessorImpl.java:57)
[junit4:junit4] > at sun.reflect.DelegatingMethodAccessorImpl.invoke(DelegatingMethodAccessorImpl.java:43)
[junit4:junit4] > at java.lang.reflect.Method.invoke(Method.java:601)
[junit4:junit4] > at com.carrotsearch.randomizedtesting.RandomizedRunner.invoke(RandomizedRunner.java:1559)
[junit4:junit4] > at com.carrotsearch.randomizedtesting.RandomizedRunner.access$600(RandomizedRunner.java:79)
[junit4:junit4] > at com.carrotsearch.randomizedtesting.RandomizedRunner$6.evaluate(RandomizedRunner.java:737)
[junit4:junit4] > at com.carrotsearch.randomizedtesting.RandomizedRunner$7.evaluate(RandomizedRunner.java:773)
[junit4:junit4] > at com.carrotsearch.randomizedtesting.RandomizedRunner$8.evaluate(RandomizedRunner.java:787)
[junit4:junit4] > at com.carrotsearch.randomizedtesting.rules.SystemPropertiesRestoreRule$1.evaluate(SystemPropertiesRestoreRule.java:53)
[junit4:junit4] > at org.apache.lucene.util.TestRuleSetupTeardownChained$1.evaluate(TestRuleSetupTeardownChained.java:50)
[junit4:junit4] > at org.apache.lucene.util.TestRuleFieldCacheSanity$1.evaluate(TestRuleFieldCacheSanity.java:51)
[junit4:junit4] > at org.apache.lucene.util.AbstractBeforeAfterRule$1.evaluate(AbstractBeforeAfterRule.java:45)
[junit4:junit4] > at com.carrotsearch.randomizedtesting.rules.SystemPropertiesInvariantRule$1.evaluate(SystemPropertiesInvariantRule.java:55)
[junit4:junit4] > at org.apache.lucene.util.TestRuleThreadAndTestName$1.evaluate(TestRuleThreadAndTestName.java:48)
[junit4:junit4] > at org.apache.lucene.util.TestRuleIgnoreAfterMaxFailures$1.evaluate(TestRuleIgnoreAfterMaxFailures.java:70)
[junit4:junit4] > at org.apache.lucene.util.TestRuleMarkFailure$1.evaluate(TestRuleMarkFailure.java:48)
[junit4:junit4] > at com.carrotsearch.randomizedtesting.rules.StatementAdapter.evaluate(StatementAdapter.java:36)
[junit4:junit4] > at com.carrotsearch.randomizedtesting.ThreadLeakControl$StatementRunner.run(ThreadLeakControl.java:358)
[junit4:junit4] > at com.carrotsearch.randomizedtesting.ThreadLeakControl.forkTimeoutingTask(ThreadLeakControl.java:782)
[junit4:junit4] > at com.carrotsearch.randomizedtesting.ThreadLeakControl$3.evaluate(ThreadLeakControl.java:442)
[junit4:junit4] > at com.carrotsearch.randomizedtesting.RandomizedRunner.runSingleTest(RandomizedRunner.java:746)
[junit4:junit4] > at com.carrotsearch.randomizedtesting.RandomizedRunner$3.evaluate(RandomizedRunner.java:648)
[junit4:junit4] > at com.carrotsearch.randomizedtesting.RandomizedRunner$4.evaluate(RandomizedRunner.java:682)
[junit4:junit4] > at com.carrotsearch.randomizedtesting.RandomizedRunner$5.evaluate(RandomizedRunner.java:693)
[junit4:junit4] > at com.carrotsearch.randomizedtesting.rules.StatementAdapter.evaluate(StatementAdapter.java:36)
[junit4:junit4] > at com.carrotsearch.randomizedtesting.rules.SystemPropertiesRestoreRule$1.evaluate(SystemPropertiesRestoreRule.java:53)
[junit4:junit4] > at org.apache.lucene.util.AbstractBeforeAfterRule$1.evaluate(AbstractBeforeAfterRule.java:45)
[junit4:junit4] > at org.apache.lucene.util.TestRuleStoreClassName$1.evaluate(TestRuleStoreClassName.java:42)
[junit4:junit4] > at com.carrotsearch.randomizedtesting.rules.SystemPropertiesInvariantRule$1.evaluate(SystemPropertiesInvariantRule.java:55)
[junit4:junit4] > at com.carrotsearch.randomizedtesting.rules.NoShadowingOrOverridesOnMethodsRule$1.evaluate(NoShadowingOrOverridesOnMethodsRule.java:39)
[junit4:junit4] > at com.carrotsearch.randomizedtesting.rules.NoShadowingOrOverridesOnMethodsRule$1.evaluate(NoShadowingOrOverridesOnMethodsRule.java:39)
[junit4:junit4] > at com.carrotsearch.randomizedtesting.rules.StatementAdapter.evaluate(StatementAdapter.java:36)
[junit4:junit4] > at org.apache.lucene.util.TestRuleAssertionsRequired$1.evaluate(TestRuleAssertionsRequired.java:43)
[junit4:junit4] > at org.apache.lucene.util.TestRuleMarkFailure$1.evaluate(TestRuleMarkFailure.java:48)
[junit4:junit4] > at org.apache.lucene.util.TestRuleIgnoreAfterMaxFailures$1.evaluate(TestRuleIgnoreAfterMaxFailures.java:70)
[junit4:junit4] > at org.apache.lucene.util.TestRuleIgnoreTestSuites$1.evaluate(TestRuleIgnoreTestSuites.java:55)
[junit4:junit4] > at com.carrotsearch.randomizedtesting.rules.StatementAdapter.evaluate(StatementAdapter.java:36)
[junit4:junit4] > at com.carrotsearch.randomizedtesting.ThreadLeakControl$StatementRunner.run(ThreadLeakControl.java:358)
[junit4:junit4] > at java.lang.Thread.run(Thread.java:722)
[junit4:junit4] > Caused by: java.lang.RuntimeException: REQUEST FAILED: xpath=*[count(//doc)=0]
[junit4:junit4] > xml response was: <?xml version="1.0" encoding="UTF-8"?>
[junit4:junit4] > <response>
[junit4:junit4] > <lst name="responseHeader"><int name="status">0</int><int name="QTime">1</int></lst><result name="response" numFound="3" start="0"><doc><str name="id">5</str></doc><doc><str name="id">6</str></doc><doc><str name="id">7</str></doc></result>
[junit4:junit4] > </response>
[junit4:junit4] >
[junit4:junit4] > request was:fl=id&q=*:*&fq={!field+f%3Dtwodoubles+score%3Dnone}Intersects(Circle(0,0+d%3D0.8993203677616635))&rows=1000
[junit4:junit4] > at org.apache.solr.SolrTestCaseJ4.assertQ(SolrTestCaseJ4.java:496)
[junit4:junit4] > ... 44 more
[junit4:junit4] 2> 3256 T2572 oas.SolrTestCaseJ4.setUp ###Starting testSort {p0=twodoubles}
[junit4:junit4] 2> 3259 T2572 C190 oasu.DirectUpdateHandler2.deleteAll [collection1] REMOVING ALL DOCUMENTS FROM INDEX
[junit4:junit4] 2> 3259 T2572 C190 UPDATE [collection1] webapp=null path=null params={} {deleteByQuery=*:*} 0 1
[junit4:junit4] 2> 3263 T2572 C190 UPDATE [collection1] webapp=null path=null params={} {add=[100]} 0 0
[junit4:junit4] 2> 3266 T2572 C190 UPDATE [collection1] webapp=null path=null params={} {add=[101]} 0 0
[junit4:junit4] 2> 3268 T2572 C190 UPDATE [collection1] webapp=null path=null params={} {add=[999]} 0 0
[junit4:junit4] 2> 3271 T2572 C190 oasu.DirectUpdateHandler2.commit start commit{flags=0,_version_=0,optimize=false,openSearcher=true,waitSearcher=true,expungeDeletes=false,softCommit=false}
[junit4:junit4] 2> 3272 T2572 C190 oasc.SolrDeletionPolicy.onCommit SolrDeletionPolicy.onCommit: commits:num=2
[junit4:junit4] 2> commit{dir=MockDirWrapper(org.apache.lucene.store.RAMDirectory [at] 1983393 lockFactory=org.apache.lucene.store.NativeFSLockFactory [at] 21cf0b6),segFN=segments_l,generation=21,filenames=[._j.fdx, _j.si, _j_nrm.cfe, _j_MockVariableIntBlock_0.skp, _j.fdt, _j_MockRandom_0.tip, _j.fnm, _j_MockRandom_0.tim, _j_MockRandom_0.skp, _j_MockRandom_0.sd, _j_MockVariableIntBlock_0.tii, _j_MockRandom_0.doc, segments_l, _j_nrm.cfs, _j_MockVariableIntBlock_0.tib, _j_MockVariableIntBlock_0.doc]
[junit4:junit4] 2> commit{dir=MockDirWrapper(org.apache.lucene.store.RAMDirectory [at] 1983393 lockFactory=org.apache.lucene.store.NativeFSLockFactory [at] 21cf0b6),segFN=segments_m,generation=22,filenames=[._k_MockVariableIntBlock_0.tii, _k_MockRandom_0.sd, _k_nrm.cfe, _k.fdt, segments_m, _k_MockVariableIntBlock_0.tib, _k.fdx, _k.fnm, _k_MockVariableIntBlock_0.doc, _k_nrm.cfs, _k_MockRandom_0.tip, _k_MockRandom_0.frq, _k_MockRandom_0.tim, _k.si, _k_MockVariableIntBlock_0.skp]
[junit4:junit4] 2> 3272 T2572 C190 oasc.SolrDeletionPolicy.updateCommits newest commit = 22
[junit4:junit4] 2> 3273 T2572 C190 oass.SolrIndexSearcher.<init> Opening Searcher [at] 5d30815 main
[junit4:junit4] 2> 3274 T2572 C190 oass.SolrIndexSearcher.getIndexDir WARNING WARNING: Directory impl does not support setting indexDir: org.apache.lucene.store.MockDirectoryWrapper
[junit4:junit4] 2> 3274 T2573 oasc.SolrCore.registerSearcher [collection1] Registered new searcher Searcher [at] 5d30815 main{StandardDirectoryReader(segments_m:69 _k(5.0):C3)}
[junit4:junit4] 2> 3274 T2572 C190 oasu.DirectUpdateHandler2.commit end_commit_flush
[junit4:junit4] 2> 3274 T2572 C190 UPDATE [collection1] webapp=null path=null params={} {commit=} 0 3
[junit4:junit4] 2> 3276 T2572 C190 REQ [collection1] webapp=null path=null params={fl=id,score&q=twodoubles:"Intersects(Circle(3,4+d%3D9))"} hits=2 status=0 QTime=1
[junit4:junit4] 2> 3277 T2572 C190 REQ [collection1] webapp=null path=null params={sort=score+asc&fl=id,score&q={!+score%3Ddistance}twodoubles:"Intersects(Circle(3,4+d%3D9))"} hits=2 status=0 QTime=1
[junit4:junit4] 2> 3277 T2572 C190 REQ [collection1] webapp=null path=null params={sort=score+desc&fl=id,score&q={!+score%3DrecipDistance}twodoubles:"Intersects(Circle(3,4+d%3D9))"} hits=2 status=0 QTime=0
[junit4:junit4] 2> 3278 T2572 C190 REQ [collection1] webapp=null path=null params={sort=score+asc&fl=id,score&q={!+score%3Ddistance}twodoubles:"Intersects(Circle(4,0+d%3D9))"} hits=2 status=0 QTime=0
[junit4:junit4] 2> 3279 T2572 C190 REQ [collection1] webapp=null path=null params={sortQuery={!+score%3Ddistance}twodoubles:"Intersects(Circle(3,4+d%3D9))"&sort=query($sortQuery)+asc&fl=id,score&q=-id:999} hits=2 status=0 QTime=1
[junit4:junit4] 2> 3280 T2572 C190 REQ [collection1] webapp=null path=null params={sortQuery={!+score%3Ddistance}twodoubles:"Intersects(Circle(4,0+d%3D9))"&sort=query($sortQuery)+asc&fl=id,score&q=-id:999} hits=2 status=0 QTime=1
[junit4:junit4] 2> 3280 T2572 oas.SolrTestCaseJ4.tearDown ###Ending testSort {p0=twodoubles}
[junit4:junit4] 2> 3283 T2572 oas.SolrTestCaseJ4.setUp ###Starting testIntersectFilter {p0=twodoubles}
[junit4:junit4] 2> 3295 T2572 C190 oasu.DirectUpdateHandler2.deleteAll [collection1] REMOVING ALL DOCUMENTS FROM INDEX
[junit4:junit4] 2> 3296 T2572 C190 UPDATE [collection1] webapp=null path=null params={} {deleteByQuery=*:*} 0 1
[junit4:junit4] 2> 3300 T2572 C190 UPDATE [collection1] webapp=null path=null params={} {add=[1]} 0 0
[junit4:junit4] 2> 3304 T2572 C190 UPDATE [collection1] webapp=null path=null params={} {add=[2]} 0 0
[junit4:junit4] 2> 3308 T2572 C190 UPDATE [collection1] webapp=null path=null params={} {add=[3]} 0 0
[junit4:junit4] 2> 3312 T2572 C190 UPDATE [collection1] webapp=null path=null params={} {add=[4]} 0 1
[junit4:junit4] 2> 3316 T2572 C190 UPDATE [collection1] webapp=null path=null params={} {add=[5]} 0 1
[junit4:junit4] 2> 3319 T2572 C190 UPDATE [collection1] webapp=null path=null params={} {add=[6]} 0 0
[junit4:junit4] 2> 3323 T2572 C190 UPDATE [collection1] webapp=null path=null params={} {add=[7]} 0 0
[junit4:junit4] 2> 3333 T2572 C190 UPDATE [collection1] webapp=null path=null params={} {add=[8]} 0 0
[junit4:junit4] 2> 3337 T2572 C190 UPDATE [collection1] webapp=null path=null params={} {add=[9]} 0 0
[junit4:junit4] 2> 3341 T2572 C190 UPDATE [collection1] webapp=null path=null params={} {add=[10]} 0 0
[junit4:junit4] 2> 3345 T2572 C190 UPDATE [collection1] webapp=null path=null params={} {add=[11]} 0 0
[junit4:junit4] 2> 3349 T2572 C190 UPDATE [collection1] webapp=null path=null params={} {add=[12]} 0 0
[junit4:junit4] 2> 3352 T2572 C190 UPDATE [collection1] webapp=null path=null params={} {add=[13]} 0 0
[junit4:junit4] 2> 3354 T2572 C190 oasu.DirectUpdateHandler2.commit start commit{flags=0,_version_=0,optimize=false,openSearcher=true,waitSearcher=true,expungeDeletes=false,softCommit=false}
[junit4:junit4] 2> 3356 T2572 C190 oasc.SolrDeletionPolicy.onCommit SolrDeletionPolicy.onCommit: commits:num=2
[junit4:junit4] 2> commit{dir=MockDirWrapper(org.apache.lucene.store.RAMDirectory [at] 1983393 lockFactory=org.apache.lucene.store.NativeFSLockFactory [at] 21cf0b6),segFN=segments_m,generation=22,filenames=[._k_MockVariableIntBlock_0.tii, _k_MockRandom_0.sd, _k_nrm.cfe, _k.fdt, segments_m, _k_MockVariableIntBlock_0.tib, _k.fdx, _k.fnm, _k_MockVariableIntBlock_0.doc, _k_nrm.cfs, _k_MockRandom_0.tip, _k_MockRandom_0.frq, _k_MockRandom_0.tim, _k.si, _k_MockVariableIntBlock_0.skp]
[junit4:junit4] 2> commit{dir=MockDirWrapper(org.apache.lucene.store.RAMDirectory [at] 1983393 lockFactory=org.apache.lucene.store.NativeFSLockFactory [at] 21cf0b6),segFN=segments_n,generation=23,filenames=[._l.fnm, _l_nrm.cfe, _l.si, segments_n, _l_MockVariableIntBlock_0.skp, _l_nrm.cfs, _l_MockRandom_0.frq, _l_MockVariableIntBlock_0.tii, _l_MockRandom_0.tiv, _l.fdx, _l_MockVariableIntBlock_0.tib, _l_MockRandom_0.tib, _l_MockRandom_0.sd, _l.fdt, _l_MockVariableIntBlock_0.doc]
[junit4:junit4] 2> 3356 T2572 C190 oasc.SolrDeletionPolicy.updateCommits newest commit = 23
[junit4:junit4] 2> 3358 T2572 C190 oass.SolrIndexSearcher.<init> Opening Searcher [at] 65aa4a3 main
[junit4:junit4] 2> 3358 T2572 C190 oass.SolrIndexSearcher.getIndexDir WARNING WARNING: Directory impl does not support setting indexDir: org.apache.lucene.store.MockDirectoryWrapper
[junit4:junit4] 2> 3358 T2573 oasc.SolrCore.registerSearcher [collection1] Registered new searcher Searcher [at] 65aa4a3 main{StandardDirectoryReader(segments_n:72 _l(5.0):C13)}
[junit4:junit4] 2> 3358 T2572 C190 oasu.DirectUpdateHandler2.commit end_commit_flush
[junit4:junit4] 2> 3359 T2572 C190 UPDATE [collection1] webapp=null path=null params={} {commit=} 0 5
[junit4:junit4] 2> 3361 T2572 C190 REQ [collection1] webapp=null path=null params={fl=id&q=*:*&fq={!field+f%3Dtwodoubles+score%3Dnone}Intersects(Circle(1,1+d%3D1.5738106435829113))&rows=1000} hits=3 status=0 QTime=1
[junit4:junit4] 2> 3364 T2572 C190 REQ [collection1] webapp=null path=null params={fl=id&q=*:*&fq={!field+f%3Dtwodoubles+score%3Dnone}Intersects(Circle(0,179.8+d%3D1.798640735523327))&rows=1000} hits=2 status=0 QTime=1
[junit4:junit4] 2> 3367 T2572 C190 REQ [collection1] webapp=null path=null params={fl=id&q=*:*&fq={!field+f%3Dtwodoubles+score%3Ddistance}Intersects(Circle(89.8,50+d%3D1.798640735523327))&rows=1000} hits=2 status=0 QTime=0
[junit4:junit4] 2> 3370 T2572 C190 REQ [collection1] webapp=null path=null params={fl=id&q=*:*&fq={!field+f%3Dtwodoubles}Intersects(Circle(-89.8,50+d%3D1.798640735523327))&rows=1000} hits=2 status=0 QTime=0
[junit4:junit4] 2> 3373 T2572 C190 REQ [collection1] webapp=null path=null params={fl=id&q=*:*&fq={!field+f%3Dtwodoubles+score%3DrecipDistance}Intersects(Circle(33.0,-80.0+d%3D2.6979611032849906))&rows=1000} hits=2 status=0 QTime=1
[junit4:junit4] 2> 3374 T2572 C190 REQ [collection1] webapp=null path=null params={fl=id&q=*:*&fq={!field+f%3Dtwodoubles}Intersects(Circle(1,1+d%3D44.96601838808318))&rows=1000} hits=3 status=0 QTime=0
[junit4:junit4] 2> 3378 T2572 C190 REQ [collection1] webapp=null path=null params={fl=id&q=*:*&fq={!field+f%3Dtwodoubles+score%3Dnone}Intersects(-0.034898+-0.034898+0.234898+0.234898)&rows=1000} hits=2 status=0 QTime=1
[junit4:junit4] 2> 3381 T2572 C190 oasu.DirectUpdateHandler2.deleteAll [collection1] REMOVING ALL DOCUMENTS FROM INDEX
[junit4:junit4] 2> 3382 T2572 C190 UPDATE [collection1] webapp=null path=null params={} {deleteByQuery=*:*} 0 1
[junit4:junit4] 2> 3385 T2572 C190 UPDATE [collection1] webapp=null path=null params={} {add=[14]} 0 0
[junit4:junit4] 2> 3388 T2572 C190 UPDATE [collection1] webapp=null path=null params={} {add=[15]} 0 1
[junit4:junit4] 2> 3390 T2572 C190 UPDATE [collection1] webapp=null path=null params={} {add=[16]} 0 0
[junit4:junit4] 2> 3393 T2572 C190 UPDATE [collection1] webapp=null path=null params={} {add=[17]} 0 0
[junit4:junit4] 2> 3395 T2572 C190 oasu.DirectUpdateHandler2.commit start commit{flags=0,_version_=0,optimize=false,openSearcher=true,waitSearcher=true,expungeDeletes=false,softCommit=false}
[junit4:junit4] 2> 3397 T2572 C190 oasc.SolrDeletionPolicy.onCommit SolrDeletionPolicy.onCommit: commits:num=2
[junit4:junit4] 2> commit{dir=MockDirWrapper(org.apache.lucene.store.RAMDirectory [at] 1983393 lockFactory=org.apache.lucene.store.NativeFSLockFactory [at] 21cf0b6),segFN=segments_n,generation=23,filenames=[._l.fnm, _l_nrm.cfe, _l.si, segments_n, _l_MockVariableIntBlock_0.skp, _l_nrm.cfs, _l_MockRandom_0.frq, _l_MockVariableIntBlock_0.tii, _l_MockRandom_0.tiv, _l.fdx, _l_MockVariableIntBlock_0.tib, _l_MockRandom_0.tib, _l_MockRandom_0.sd, _l.fdt, _l_MockVariableIntBlock_0.doc]
[junit4:junit4] 2> commit{dir=MockDirWrapper(org.apache.lucene.store.RAMDirectory [at] 1983393 lockFactory=org.apache.lucene.store.NativeFSLockFactory [at] 21cf0b6),segFN=segments_o,generation=24,filenames=[._m_nrm.cfe, _m_MockRandom_0.tip, _m_MockVariableIntBlock_0.doc, _m_MockRandom_0.tim, _m_MockRandom_0.skp, _m_MockVariableIntBlock_0.tii, _m_MockVariableIntBlock_0.skp, _m_MockVariableIntBlock_0.tib, _m.si, _m.fdt, _m_MockRandom_0.doc, _m_MockRandom_0.sd, _m_nrm.cfs, segments_o, _m.fdx, _m.fnm]
[junit4:junit4] 2> 3397 T2572 C190 oasc.SolrDeletionPolicy.updateCommits newest commit = 24
[junit4:junit4] 2> 3399 T2572 C190 oass.SolrIndexSearcher.<init> Opening Searcher [at] 4184ec6 main
[junit4:junit4] 2> 3399 T2572 C190 oass.SolrIndexSearcher.getIndexDir WARNING WARNING: Directory impl does not support setting indexDir: org.apache.lucene.store.MockDirectoryWrapper
[junit4:junit4] 2> 3399 T2572 C190 oasu.DirectUpdateHandler2.commit end_commit_flush
[junit4:junit4] 2> 3423 T2573 oasc.SolrCore.registerSearcher [collection1] Registered new searcher Searcher [at] 4184ec6 main{StandardDirectoryReader(segments_o:75 _m(5.0):C4)}
[junit4:junit4] 2> 3423 T2572 C190 UPDATE [collection1] webapp=null path=null params={} {commit=} 0 28
[junit4:junit4] 2> 3425 T2572 C190 REQ [collection1] webapp=null path=null params={fl=id&q=*:*&fq={!field+f%3Dtwodoubles+score%3Ddistance}Intersects(Circle(0,0+d%3D8.993203677616636))&rows=1000} hits=1 status=0 QTime=0
[junit4:junit4] 2> 3427 T2572 C190 REQ [collection1] webapp=null path=null params={fl=id&q=*:*&fq={!field+f%3Dtwodoubles}Intersects(Circle(0,0+d%3D17.986407355233272))&rows=1000} hits=2 status=0 QTime=0
[junit4:junit4] 2> 3430 T2572 C190 REQ [collection1] webapp=null path=null params={fl=id&q=*:*&fq={!field+f%3Dtwodoubles+score%3Ddistance}Intersects(-26.979611+-26.979611+26.979611+26.979611)&rows=1000} hits=3 status=0 QTime=0
[junit4:junit4] 2> 3433 T2572 C190 REQ [collection1] webapp=null path=null params={fl=id&q=*:*&fq={!field+f%3Dtwodoubles}Intersects(Circle(0,0+d%3D26.98860423652752))&rows=1000} hits=3 status=0 QTime=0
[junit4:junit4] 2> 3437 T2572 C190 REQ [collection1] webapp=null path=null params={fl=id&q=*:*&fq={!field+f%3Dtwodoubles}Intersects(Circle(0,0+d%3D26.980510353217664))&rows=1000} hits=3 status=0 QTime=1
[junit4:junit4] 2> 3440 T2572 C190 REQ [collection1] webapp=null path=null params={fl=id&q=*:*&fq={!field+f%3Dtwodoubles}Intersects(Circle(43.517030,-96.789603+d%3D0.9802592008602133))&rows=1000} hits=0 status=0 QTime=0
[junit4:junit4] 2> 3442 T2572 C190 REQ [collection1] webapp=null path=null params={fl=id&q=*:*&fq={!field+f%3Dtwodoubles+score%3Ddistance}Intersects(Circle(43.517030,-96.789603+d%3D0.9892524045378299))&rows=1000} hits=0 status=0 QTime=1
[junit4:junit4] 2> 3443 T2572 C190 REQ [collection1] webapp=null path=null params={fl=id&q=*:*&fq={!field+f%3Dtwodoubles+score%3Dnone}Intersects(-98.153831+42.527778+-95.425375+44.506282)&rows=1000} hits=1 status=0 QTime=0
[junit4:junit4] 2> 3444 T2572 oas.SolrTestCaseJ4.tearDown ###Ending testIntersectFilter {p0=twodoubles}
[junit4:junit4] 2> 3446 T2572 oas.SolrTestCaseJ4.deleteCore ###deleteCore
[junit4:junit4] 2> 3446 T2572 oasc.CoreContainer.shutdown Shutting down CoreContainer instance=726671478
[junit4:junit4] 2> 3446 T2572 oasc.SolrCore.close [collection1] CLOSING SolrCore org.apache.solr.core.SolrCore [at] 69b83d2
[junit4:junit4] 2> 3446 T2572 oasc.SolrCore.closeSearcher [collection1] Closing main searcher on request.
[junit4:junit4] 2> 3447 T2572 oasu.DirectUpdateHandler2.close closing DirectUpdateHandler2{commits=23,autocommits=0,soft autocommits=0,optimizes=0,rollbacks=0,expungeDeletes=0,docsPending=0,adds=0,deletesById=0,deletesByQuery=0,errors=0,cumulative_adds=142,cumulative_deletesById=0,cumulative_deletesByQuery=28,cumulative_errors=0}
[junit4:junit4] 2> 3447 T2572 oasu.DefaultSolrCoreState.decref SolrCoreState ref count has reached 0 - closing IndexWriter
[junit4:junit4] 2> 3449 T2572 oasu.DefaultSolrCoreState.decref Closing SolrCoreState - canceling any ongoing recovery
[junit4:junit4] 2> NOTE: test params are: codec=Lucene40: {stqpt_geohash=PostingsFormat(name=TestBloomFilteredLucene40Postings), id=MockVariableIntBlock(baseBlockSize=62), twodoubles__x=PostingsFormat(name=MockRandom), twodoubles__y=MockVariableIntBlock(baseBlockSize=62), srpt_geohash=MockVariableIntBlock(baseBlockSize=62), srpt_quad=PostingsFormat(name=NestedPulsing)}, sim=RandomSimilarityProvider(queryNorm=true,coord=crazy): {}, locale=es_CR, timezone=Africa/Ndjamena
[junit4:junit4] 2> NOTE: Linux 3.2.0-30-generic amd64/Oracle Corporation 1.7.0_07 (64-bit)/cpus=8,threads=1,free=149876600,total=248930304
[junit4:junit4] 2> NOTE: All tests run in this JVM: [.TestStressLucene, SpellingQueryConverterTest, XmlUpdateRequestHandlerTest, TestDocumentBuilder, TestSort, TestPropInjectDefaults, BasicDistributedZk2Test, RequiredFieldsTest, FileUtilsTest, TestRTGBase, TestValueSourceCache, TestBM25SimilarityFactory, UpdateParamsTest, OpenExchangeRatesOrgProviderTest, EchoParamsTest, StatsComponentTest, BadIndexSchemaTest, SyncSliceTest, SuggesterTest, TestCSVResponseWriter, TestReplicationHandler, RecoveryZkTest, IndexSchemaTest, BasicZkTest, TestLRUCache, DocumentBuilderTest, PeerSyncTest, DocumentAnalysisRequestHandlerTest, DirectUpdateHandlerTest, TestRealTimeGet, TestSurroundQueryParser, PingRequestHandlerTest, FieldMutatingUpdateProcessorTest, TestCharFilters, TestDistributedGrouping, TestSolrDeletionPolicy1, DebugComponentTest, DistributedQueryElevationComponentTest, RAMDirectoryFactoryTest, SolrInfoMBeanTest, PrimUtilsTest, TestCSVLoader, QueryParsingTest, DOMUtilTest, DirectSolrSpellCheckerTest, PathHierarchyTokenizerFactoryTest, StatelessScriptUpdateProcessorFactoryTest, HighlighterTest, DisMaxRequestHandlerTest, ConvertedLegacyTest, TestQuerySenderListener, ZkSolrClientTest, LeaderElectionTest, TestArbitraryIndexDir, OverseerTest, FullSolrCloudDistribCmdsTest, TestDistributedSearch, TestRecovery, SolrCoreTest, TestRangeQuery, TestMultiCoreConfBootstrap, SimpleFacetsTest, LukeRequestHandlerTest, TestGroupingSearch, BasicFunctionalityTest, SignatureUpdateProcessorFactoryTest, TestBinaryResponseWriter, TestJmxIntegration, SampleTest, TestFunctionQuery, SolrRequestParserTest, QueryEqualityTest, PolyFieldTest, CurrencyFieldTest, BinaryUpdateRequestHandlerTest, XsltUpdateRequestHandlerTest, TestPHPSerializedResponseWriter, TermVectorComponentTest, JsonLoaderTest, IndexSchemaRuntimeFieldTest, TestReversedWildcardFilterFactory, RequestHandlersTest, TestQueryUtils, CSVRequestHandlerTest, NotRequiredUniqueKeyTest, TestFoldingMultitermQuery, TestPropInject, TestIndexingPerformance, BadComponentTest, TestBinaryField, TestSolrDeletionPolicy2, DefaultValueUpdateProcessorTest, TestDocSet, SolrIndexConfigTest, NumericFieldsTest, MultiTermTest, SpellPossibilityIteratorTest, TestLMDirichletSimilarityFactory, LegacyHTMLStripCharFilterTest, TestCodecSupport, DateMathParserTest, ResourceLoaderTest, TestSuggestSpellingConverter, TestUtils, ZkNodePropsTest, ClusterStateTest, ClusterStateUpdateTest, TestReload, TestSolr4Spatial]
[junit4:junit4] Completed on J1 in 3.47s, 24 tests, 4 errors, 1 skipped <<< FAILURES!

[...truncated 23 lines...]
BUILD FAILED
/mnt/ssd/jenkins/workspace/Lucene-Solr-trunk-Linux/build.xml:32: The following error occurred while executing this line:
/mnt/ssd/jenkins/workspace/Lucene-Solr-trunk-Linux/solr/build.xml:146: The following error occurred while executing this line:
/mnt/ssd/jenkins/workspace/Lucene-Solr-trunk-Linux/lucene/module-build.xml:63: The following error occurred while executing this line:
/mnt/ssd/jenkins/workspace/Lucene-Solr-trunk-Linux/lucene/common-build.xml:1133: The following error occurred while executing this line:
/mnt/ssd/jenkins/workspace/Lucene-Solr-trunk-Linux/lucene/common-build.xml:810: There were test failures: 229 suites, 947 tests, 4 errors, 7 ignored (2 assumptions)

Total time: 22 minutes 44 seconds
Build step 'Invoke Ant' marked build as failure
Recording test results
Description set: Java: 64bit/jdk1.7.0_07 -XX:+UseConcMarkSweepGC
Email was triggered for: Failure
Sending email for trigger: Failure

Lucene java-dev RSS feed   Index | Next | Previous | View Threaded
 
 


Interested in having your list archived? Contact Gossamer Threads
 
  Web Applications & Managed Hosting Powered by Gossamer Threads Inc.