Login | Register For Free | Help
Search for: (Advanced)

Mailing List Archive: Lucene: Java-Dev

[JENKINS] Lucene-Solr-trunk-Windows (32bit/jdk1.7.0_05) - Build # 202 - Failure!

 

 

Lucene java-dev RSS feed   Index | Next | Previous | View Threaded


jenkins at sd-datasolutions

Aug 11, 2012, 2:26 PM

Post #1 of 1 (87 views)
Permalink
[JENKINS] Lucene-Solr-trunk-Windows (32bit/jdk1.7.0_05) - Build # 202 - Failure!

Build: http://jenkins.sd-datasolutions.de/job/Lucene-Solr-trunk-Windows/202/
Java: 32bit/jdk1.7.0_05 -client -XX:+UseParallelGC

1 tests failed.
FAILED: junit.framework.TestSuite.org.apache.solr.handler.TestReplicationHandler

Error Message:
ERROR: SolrIndexSearcher opens=76 closes=75

Stack Trace:
java.lang.AssertionError: ERROR: SolrIndexSearcher opens=76 closes=75
at __randomizedtesting.SeedInfo.seed([52390432AE74C307]:0)
at org.junit.Assert.fail(Assert.java:93)
at org.apache.solr.SolrTestCaseJ4.endTrackingSearchers(SolrTestCaseJ4.java:216)
at org.apache.solr.SolrTestCaseJ4.afterClass(SolrTestCaseJ4.java:82)
at sun.reflect.GeneratedMethodAccessor15.invoke(Unknown Source)
at sun.reflect.DelegatingMethodAccessorImpl.invoke(DelegatingMethodAccessorImpl.java:43)
at java.lang.reflect.Method.invoke(Method.java:601)
at com.carrotsearch.randomizedtesting.RandomizedRunner.invoke(RandomizedRunner.java:1995)
at com.carrotsearch.randomizedtesting.RandomizedRunner.access$1100(RandomizedRunner.java:132)
at com.carrotsearch.randomizedtesting.RandomizedRunner$5.evaluate(RandomizedRunner.java:754)
at com.carrotsearch.randomizedtesting.rules.SystemPropertiesRestoreRule$1.evaluate(SystemPropertiesRestoreRule.java:53)
at org.apache.lucene.util.AbstractBeforeAfterRule$1.evaluate(AbstractBeforeAfterRule.java:45)
at org.apache.lucene.util.TestRuleReportUncaughtExceptions$1.evaluate(TestRuleReportUncaughtExceptions.java:68)
at org.apache.lucene.util.TestRuleStoreClassName$1.evaluate(TestRuleStoreClassName.java:38)
at com.carrotsearch.randomizedtesting.rules.SystemPropertiesInvariantRule$1.evaluate(SystemPropertiesInvariantRule.java:55)
at org.apache.lucene.util.TestRuleNoInstanceHooksOverrides$1.evaluate(TestRuleNoInstanceHooksOverrides.java:53)
at org.apache.lucene.util.TestRuleNoStaticHooksShadowing$1.evaluate(TestRuleNoStaticHooksShadowing.java:52)
at org.apache.lucene.util.TestRuleAssertionsRequired$1.evaluate(TestRuleAssertionsRequired.java:36)
at org.apache.lucene.util.TestRuleMarkFailure$1.evaluate(TestRuleMarkFailure.java:48)
at org.apache.lucene.util.TestRuleIgnoreAfterMaxFailures$1.evaluate(TestRuleIgnoreAfterMaxFailures.java:70)
at org.apache.lucene.util.TestRuleIgnoreTestSuites$1.evaluate(TestRuleIgnoreTestSuites.java:55)
at com.carrotsearch.randomizedtesting.RandomizedRunner.runSuite(RandomizedRunner.java:605)
at com.carrotsearch.randomizedtesting.RandomizedRunner.access$400(RandomizedRunner.java:132)
at com.carrotsearch.randomizedtesting.RandomizedRunner$2.run(RandomizedRunner.java:551)




Build Log:
[...truncated 7640 lines...]
[junit4:junit4] Suite: org.apache.solr.handler.TestReplicationHandler
[junit4:junit4] > (@BeforeClass output)
[junit4:junit4] 2> 4 T2073 oejs.Server.doStart jetty-8.1.2.v20120308
[junit4:junit4] 2> 6 T2073 oejs.AbstractConnector.doStart Started SocketConnector [at] 0:56907
[junit4:junit4] 2> 7 T2073 oasc.SolrResourceLoader.locateSolrHome JNDI not configured for solr (NoInitialContextEx)
[junit4:junit4] 2> 7 T2073 oasc.SolrResourceLoader.locateSolrHome using system property solr.solr.home: .\org.apache.solr.handler.TestReplicationHandler$SolrInstance-1344719738648\master
[junit4:junit4] 2> 7 T2073 oasc.SolrResourceLoader.<init> new SolrResourceLoader for deduced Solr Home: '.\org.apache.solr.handler.TestReplicationHandler$SolrInstance-1344719738648\master\'
[junit4:junit4] 2> 20 T2073 oass.SolrDispatchFilter.init SolrDispatchFilter.init()
[junit4:junit4] 2> 20 T2073 oasc.SolrResourceLoader.locateSolrHome JNDI not configured for solr (NoInitialContextEx)
[junit4:junit4] 2> 21 T2073 oasc.SolrResourceLoader.locateSolrHome using system property solr.solr.home: .\org.apache.solr.handler.TestReplicationHandler$SolrInstance-1344719738648\master
[junit4:junit4] 2> 21 T2073 oasc.CoreContainer$Initializer.initialize looking for solr.xml: C:\Jenkins\workspace\Lucene-Solr-trunk-Windows\solr\build\solr-core\test\J0\.\org.apache.solr.handler.TestReplicationHandler$SolrInstance-1344719738648\master\solr.xml
[junit4:junit4] 2> 21 T2073 oasc.CoreContainer.<init> New CoreContainer 30380883
[junit4:junit4] 2> 21 T2073 oasc.CoreContainer$Initializer.initialize no solr.xml file found - using default
[junit4:junit4] 2> 21 T2073 oasc.CoreContainer.load Loading CoreContainer using Solr Home: '.\org.apache.solr.handler.TestReplicationHandler$SolrInstance-1344719738648\master\'
[junit4:junit4] 2> 22 T2073 oasc.SolrResourceLoader.<init> new SolrResourceLoader for directory: '.\org.apache.solr.handler.TestReplicationHandler$SolrInstance-1344719738648\master\'
[junit4:junit4] 2> 36 T2073 oasc.CoreContainer.load Registering Log Listener
[junit4:junit4] 2> 57 T2073 oasc.CoreContainer.create Creating SolrCore 'collection1' using instanceDir: .\org.apache.solr.handler.TestReplicationHandler$SolrInstance-1344719738648\master\collection1
[junit4:junit4] 2> 58 T2073 oasc.SolrResourceLoader.<init> new SolrResourceLoader for directory: '.\org.apache.solr.handler.TestReplicationHandler$SolrInstance-1344719738648\master\collection1\'
[junit4:junit4] 2> 93 T2073 oasc.SolrConfig.<init> Using Lucene MatchVersion: LUCENE_50
[junit4:junit4] 2> 160 T2073 oasc.SolrConfig.<init> Loaded SolrConfig: solrconfig.xml
[junit4:junit4] 2> 160 T2073 oass.IndexSchema.readSchema Reading Solr Schema
[junit4:junit4] 2> 163 T2073 oass.IndexSchema.readSchema Schema name=test
[junit4:junit4] 2> 183 T2073 oass.IndexSchema.readSchema unique key field: id
[junit4:junit4] 2> 185 T2073 oasc.SolrCore.<init> [collection1] Opening new SolrCore at .\org.apache.solr.handler.TestReplicationHandler$SolrInstance-1344719738648\master\collection1\, dataDir=.\org.apache.solr.handler.TestReplicationHandler$SolrInstance-1344719738648\master\collection1\data\
[junit4:junit4] 2> 185 T2073 oasc.SolrCore.<init> JMX monitoring not detected for core: collection1
[junit4:junit4] 2> 186 T2073 oasc.SolrCore.getNewIndexDir WARNING New index directory detected: old=null new=.\org.apache.solr.handler.TestReplicationHandler$SolrInstance-1344719738648\master\collection1\data\index/
[junit4:junit4] 2> 186 T2073 oasc.SolrCore.initIndex WARNING [collection1] Solr index directory '.\org.apache.solr.handler.TestReplicationHandler$SolrInstance-1344719738648\master\collection1\data\index' doesn't exist. Creating new index...
[junit4:junit4] 2> 193 T2073 oasc.SolrDeletionPolicy.onCommit SolrDeletionPolicy.onCommit: commits:num=1
[junit4:junit4] 2> commit{dir=NRTCachingDirectory(org.apache.lucene.store.SimpleFSDirectory@C:\Jenkins\workspace\Lucene-Solr-trunk-Windows\solr\build\solr-core\test\J0\org.apache.solr.handler.TestReplicationHandler$SolrInstance-1344719738648\master\collection1\data\index lockFactory=org.apache.lucene.store.SingleInstanceLockFactory [at] 1dfc; maxCacheMB=48.0 maxMergeSizeMB=4.0),segFN=segments_1,generation=1,filenames=[segments_1]
[junit4:junit4] 2> 193 T2073 oasc.SolrDeletionPolicy.updateCommits newest commit = 1
[junit4:junit4] 2> 194 T2073 oasc.RequestHandlers.initHandlersFromConfig created standard: solr.StandardRequestHandler
[junit4:junit4] 2> 194 T2073 oasc.RequestHandlers.initHandlersFromConfig created /replication: solr.ReplicationHandler
[junit4:junit4] 2> 194 T2073 oasc.RequestHandlers.initHandlersFromConfig created defaults: solr.StandardRequestHandler
[junit4:junit4] 2> 195 T2073 oasc.RequestHandlers.initHandlersFromConfig adding lazy requestHandler: solr.StandardRequestHandler
[junit4:junit4] 2> 195 T2073 oasc.RequestHandlers.initHandlersFromConfig created lazy: solr.StandardRequestHandler
[junit4:junit4] 2> 195 T2073 oasc.RequestHandlers.initHandlersFromConfig created /update: solr.UpdateRequestHandler
[junit4:junit4] 2> 196 T2073 oashl.XMLLoader.init xsltCacheLifetimeSeconds=60
[junit4:junit4] 2> 199 T2073 oass.SolrIndexSearcher.<init> Opening Searcher [at] 158eac main
[junit4:junit4] 2> 200 T2073 oasu.CommitTracker.<init> Hard AutoCommit: disabled
[junit4:junit4] 2> 200 T2073 oasu.CommitTracker.<init> Soft AutoCommit: disabled
[junit4:junit4] 2> 200 T2073 oashc.HttpShardHandlerFactory.getParameter Setting socketTimeout to: 0
[junit4:junit4] 2> 200 T2073 oashc.HttpShardHandlerFactory.getParameter Setting urlScheme to: http://
[junit4:junit4] 2> 201 T2073 oashc.HttpShardHandlerFactory.getParameter Setting connTimeout to: 0
[junit4:junit4] 2> 201 T2073 oashc.HttpShardHandlerFactory.getParameter Setting maxConnectionsPerHost to: 20
[junit4:junit4] 2> 201 T2073 oashc.HttpShardHandlerFactory.getParameter Setting corePoolSize to: 0
[junit4:junit4] 2> 201 T2073 oashc.HttpShardHandlerFactory.getParameter Setting maximumPoolSize to: 2147483647
[junit4:junit4] 2> 201 T2073 oashc.HttpShardHandlerFactory.getParameter Setting maxThreadIdleTime to: 5
[junit4:junit4] 2> 202 T2073 oashc.HttpShardHandlerFactory.getParameter Setting sizeOfQueue to: -1
[junit4:junit4] 2> 202 T2073 oashc.HttpShardHandlerFactory.getParameter Setting fairnessPolicy to: false
[junit4:junit4] 2> 202 T2073 oascsi.HttpClientUtil.createClient Creating new http client, config:maxConnectionsPerHost=20&maxConnections=10000&socketTimeout=0&connTimeout=0&retry=false
[junit4:junit4] 2> 206 T2073 oash.ReplicationHandler.inform Replication enabled for following config files: schema.xml
[junit4:junit4] 2> 207 T2073 oash.ReplicationHandler.inform Commits will be reserved for 10000
[junit4:junit4] 2> 207 T2083 oasc.SolrCore.registerSearcher [collection1] Registered new searcher Searcher [at] 158eac main{StandardDirectoryReader(segments_1:1)}
[junit4:junit4] 2> 207 T2073 oasc.CoreContainer.register registering core: collection1
[junit4:junit4] 2> 207 T2073 oass.SolrDispatchFilter.init user.dir=C:\Jenkins\workspace\Lucene-Solr-trunk-Windows\solr\build\solr-core\test\J0
[junit4:junit4] 2> 207 T2073 oass.SolrDispatchFilter.init SolrDispatchFilter.init() done
[junit4:junit4] 2> 208 T2073 oascsi.HttpClientUtil.createClient Creating new http client, config:maxConnections=128&maxConnectionsPerHost=32&followRedirects=false
[junit4:junit4] 2> 214 T2073 oejs.Server.doStart jetty-8.1.2.v20120308
[junit4:junit4] 2> 216 T2073 oejs.AbstractConnector.doStart Started SocketConnector [at] 0:56908
[junit4:junit4] 2> 217 T2073 oasc.SolrResourceLoader.locateSolrHome JNDI not configured for solr (NoInitialContextEx)
[junit4:junit4] 2> 217 T2073 oasc.SolrResourceLoader.locateSolrHome using system property solr.solr.home: .\org.apache.solr.handler.TestReplicationHandler$SolrInstance-1344719738860\slave
[junit4:junit4] 2> 217 T2073 oasc.SolrResourceLoader.<init> new SolrResourceLoader for deduced Solr Home: '.\org.apache.solr.handler.TestReplicationHandler$SolrInstance-1344719738860\slave\'
[junit4:junit4] 2> 229 T2073 oass.SolrDispatchFilter.init SolrDispatchFilter.init()
[junit4:junit4] 2> 229 T2073 oasc.SolrResourceLoader.locateSolrHome JNDI not configured for solr (NoInitialContextEx)
[junit4:junit4] 2> 230 T2073 oasc.SolrResourceLoader.locateSolrHome using system property solr.solr.home: .\org.apache.solr.handler.TestReplicationHandler$SolrInstance-1344719738860\slave
[junit4:junit4] 2> 230 T2073 oasc.CoreContainer$Initializer.initialize looking for solr.xml: C:\Jenkins\workspace\Lucene-Solr-trunk-Windows\solr\build\solr-core\test\J0\.\org.apache.solr.handler.TestReplicationHandler$SolrInstance-1344719738860\slave\solr.xml
[junit4:junit4] 2> 230 T2073 oasc.CoreContainer.<init> New CoreContainer 19867976
[junit4:junit4] 2> 230 T2073 oasc.CoreContainer$Initializer.initialize no solr.xml file found - using default
[junit4:junit4] 2> 231 T2073 oasc.CoreContainer.load Loading CoreContainer using Solr Home: '.\org.apache.solr.handler.TestReplicationHandler$SolrInstance-1344719738860\slave\'
[junit4:junit4] 2> 231 T2073 oasc.SolrResourceLoader.<init> new SolrResourceLoader for directory: '.\org.apache.solr.handler.TestReplicationHandler$SolrInstance-1344719738860\slave\'
[junit4:junit4] 2> 244 T2073 oasc.CoreContainer.load Registering Log Listener
[junit4:junit4] 2> 266 T2073 oasc.CoreContainer.create Creating SolrCore 'collection1' using instanceDir: .\org.apache.solr.handler.TestReplicationHandler$SolrInstance-1344719738860\slave\collection1
[junit4:junit4] 2> 267 T2073 oasc.SolrResourceLoader.<init> new SolrResourceLoader for directory: '.\org.apache.solr.handler.TestReplicationHandler$SolrInstance-1344719738860\slave\collection1\'
[junit4:junit4] 2> 303 T2073 oasc.SolrConfig.<init> Using Lucene MatchVersion: LUCENE_50
[junit4:junit4] 2> 362 T2073 oasc.SolrConfig.<init> Loaded SolrConfig: solrconfig.xml
[junit4:junit4] 2> 363 T2073 oass.IndexSchema.readSchema Reading Solr Schema
[junit4:junit4] 2> 365 T2073 oass.IndexSchema.readSchema Schema name=test
[junit4:junit4] 2> 387 T2073 oass.IndexSchema.readSchema unique key field: id
[junit4:junit4] 2> 388 T2073 oasc.SolrCore.<init> [collection1] Opening new SolrCore at .\org.apache.solr.handler.TestReplicationHandler$SolrInstance-1344719738860\slave\collection1\, dataDir=.\org.apache.solr.handler.TestReplicationHandler$SolrInstance-1344719738860\slave\collection1\data\
[junit4:junit4] 2> 389 T2073 oasc.SolrCore.<init> JMX monitoring not detected for core: collection1
[junit4:junit4] 2> 389 T2073 oasc.SolrCore.getNewIndexDir WARNING New index directory detected: old=null new=.\org.apache.solr.handler.TestReplicationHandler$SolrInstance-1344719738860\slave\collection1\data\index/
[junit4:junit4] 2> 390 T2073 oasc.SolrCore.initIndex WARNING [collection1] Solr index directory '.\org.apache.solr.handler.TestReplicationHandler$SolrInstance-1344719738860\slave\collection1\data\index' doesn't exist. Creating new index...
[junit4:junit4] 2> 396 T2073 oasc.SolrDeletionPolicy.onCommit SolrDeletionPolicy.onCommit: commits:num=1
[junit4:junit4] 2> commit{dir=NRTCachingDirectory(org.apache.lucene.store.SimpleFSDirectory@C:\Jenkins\workspace\Lucene-Solr-trunk-Windows\solr\build\solr-core\test\J0\org.apache.solr.handler.TestReplicationHandler$SolrInstance-1344719738860\slave\collection1\data\index lockFactory=org.apache.lucene.store.SingleInstanceLockFactory [at] 16b8b4; maxCacheMB=48.0 maxMergeSizeMB=4.0),segFN=segments_1,generation=1,filenames=[segments_1]
[junit4:junit4] 2> 396 T2073 oasc.SolrDeletionPolicy.updateCommits newest commit = 1
[junit4:junit4] 2> 396 T2073 oasc.RequestHandlers.initHandlersFromConfig created standard: solr.StandardRequestHandler
[junit4:junit4] 2> 397 T2073 oasc.RequestHandlers.initHandlersFromConfig created defaults: solr.StandardRequestHandler
[junit4:junit4] 2> 397 T2073 oasc.RequestHandlers.initHandlersFromConfig adding lazy requestHandler: solr.StandardRequestHandler
[junit4:junit4] 2> 397 T2073 oasc.RequestHandlers.initHandlersFromConfig created lazy: solr.StandardRequestHandler
[junit4:junit4] 2> 397 T2073 oasc.RequestHandlers.initHandlersFromConfig created /update: solr.UpdateRequestHandler
[junit4:junit4] 2> 398 T2073 oasc.RequestHandlers.initHandlersFromConfig created /replication: solr.ReplicationHandler
[junit4:junit4] 2> 399 T2073 oashl.XMLLoader.init xsltCacheLifetimeSeconds=60
[junit4:junit4] 2> 403 T2073 oass.SolrIndexSearcher.<init> Opening Searcher [at] 4de4a main
[junit4:junit4] 2> 403 T2073 oasu.CommitTracker.<init> Hard AutoCommit: disabled
[junit4:junit4] 2> 403 T2073 oasu.CommitTracker.<init> Soft AutoCommit: disabled
[junit4:junit4] 2> 403 T2073 oashc.HttpShardHandlerFactory.getParameter Setting socketTimeout to: 0
[junit4:junit4] 2> 404 T2073 oashc.HttpShardHandlerFactory.getParameter Setting urlScheme to: http://
[junit4:junit4] 2> 404 T2073 oashc.HttpShardHandlerFactory.getParameter Setting connTimeout to: 0
[junit4:junit4] 2> 404 T2073 oashc.HttpShardHandlerFactory.getParameter Setting maxConnectionsPerHost to: 20
[junit4:junit4] 2> 404 T2073 oashc.HttpShardHandlerFactory.getParameter Setting corePoolSize to: 0
[junit4:junit4] 2> 404 T2073 oashc.HttpShardHandlerFactory.getParameter Setting maximumPoolSize to: 2147483647
[junit4:junit4] 2> 405 T2073 oashc.HttpShardHandlerFactory.getParameter Setting maxThreadIdleTime to: 5
[junit4:junit4] 2> 405 T2073 oashc.HttpShardHandlerFactory.getParameter Setting sizeOfQueue to: -1
[junit4:junit4] 2> 405 T2073 oashc.HttpShardHandlerFactory.getParameter Setting fairnessPolicy to: false
[junit4:junit4] 2> 405 T2073 oascsi.HttpClientUtil.createClient Creating new http client, config:maxConnectionsPerHost=20&maxConnections=10000&socketTimeout=0&connTimeout=0&retry=false
[junit4:junit4] 2> 410 T2073 oash.SnapPuller.startExecutorService Poll Scheduled at an interval of 1000ms
[junit4:junit4] 2> 410 T2093 oasc.SolrCore.registerSearcher [collection1] Registered new searcher Searcher [at] 4de4a main{StandardDirectoryReader(segments_1:1)}
[junit4:junit4] 2> 410 T2073 oasc.CoreContainer.register registering core: collection1
[junit4:junit4] 2> 411 T2073 oass.SolrDispatchFilter.init user.dir=C:\Jenkins\workspace\Lucene-Solr-trunk-Windows\solr\build\solr-core\test\J0
[junit4:junit4] 2> 411 T2073 oass.SolrDispatchFilter.init SolrDispatchFilter.init() done
[junit4:junit4] 2> 411 T2073 oascsi.HttpClientUtil.createClient Creating new http client, config:maxConnections=128&maxConnectionsPerHost=32&followRedirects=false
[junit4:junit4] 2>
[junit4:junit4] > (@AfterClass output)
[junit4:junit4] 2> 30771 T2073 oasc.CoreContainer.shutdown Shutting down CoreContainer instance=10016516
[junit4:junit4] 2> 30771 T2073 oasc.SolrCore.close [collection1] CLOSING SolrCore org.apache.solr.core.SolrCore [at] 1bd388
[junit4:junit4] 2> 30771 T2073 oasc.SolrCore.closeSearcher [collection1] Closing main searcher on request.
[junit4:junit4] 2> 30771 T2073 oasu.DirectUpdateHandler2.close closing DirectUpdateHandler2{commits=1,autocommits=0,soft autocommits=0,optimizes=0,rollbacks=0,expungeDeletes=0,docsPending=0,adds=0,deletesById=0,deletesByQuery=0,errors=0,cumulative_adds=493,cumulative_deletesById=0,cumulative_deletesByQuery=1,cumulative_errors=0}
[junit4:junit4] 2> 30775 T2073 oejsh.ContextHandler.doStop stopped o.e.j.s.ServletContextHandler{/solr,null}
[junit4:junit4] 2> 30828 T2073 oasc.CoreContainer.shutdown Shutting down CoreContainer instance=1357298
[junit4:junit4] 2> 30829 T2073 oasc.SolrCore.close [collection1] CLOSING SolrCore org.apache.solr.core.SolrCore [at] a1b2a
[junit4:junit4] 2> 30829 T2073 oasc.SolrCore.closeSearcher [collection1] Closing main searcher on request.
[junit4:junit4] 2> 30829 T2073 oasu.DirectUpdateHandler2.close closing DirectUpdateHandler2{commits=2,autocommits=0,soft autocommits=0,optimizes=0,rollbacks=0,expungeDeletes=0,docsPending=0,adds=0,deletesById=0,deletesByQuery=0,errors=0,cumulative_adds=1,cumulative_deletesById=0,cumulative_deletesByQuery=0,cumulative_errors=0}
[junit4:junit4] 2> 30832 T2073 oejsh.ContextHandler.doStop stopped o.e.j.s.ServletContextHandler{/solr,null}
[junit4:junit4] 2> !!!! WARNING: best effort to remove C:\Jenkins\workspace\Lucene-Solr-trunk-Windows\solr\build\solr-core\test\J0\.\org.apache.solr.handler.TestReplicationHandler$SolrInstance-1344719738860\slave\collection1\data\index.20120812011559009\_7.fdt FAILED !!!!!
[junit4:junit4] 2> !!!! WARNING: best effort to remove C:\Jenkins\workspace\Lucene-Solr-trunk-Windows\solr\build\solr-core\test\J0\.\org.apache.solr.handler.TestReplicationHandler$SolrInstance-1344719738860\slave\collection1\data\index.20120812011559009 FAILED !!!!!
[junit4:junit4] 2> !!!! WARNING: best effort to remove C:\Jenkins\workspace\Lucene-Solr-trunk-Windows\solr\build\solr-core\test\J0\.\org.apache.solr.handler.TestReplicationHandler$SolrInstance-1344719738860\slave\collection1\data FAILED !!!!!
[junit4:junit4] 2> !!!! WARNING: best effort to remove C:\Jenkins\workspace\Lucene-Solr-trunk-Windows\solr\build\solr-core\test\J0\.\org.apache.solr.handler.TestReplicationHandler$SolrInstance-1344719738860\slave\collection1 FAILED !!!!!
[junit4:junit4] 2> 30897 T2073 oas.SolrTestCaseJ4.deleteCore ###deleteCore
[junit4:junit4] 2> 32277 T2275 oash.SnapPuller.fetchLatestIndex SEVERE Master at: http://localhost:56947/solr is not available. Index fetch failed. Exception: org.apache.solr.client.solrj.SolrServerException: Server refused connection at: http://localhost:56947/solr
[junit4:junit4] 2> 153071 T2073 oas.SolrTestCaseJ4.endTrackingSearchers SEVERE ERROR: SolrIndexSearcher opens=76 closes=75
[junit4:junit4] 2> NOTE: test params are: codec=Lucene40: {newname=MockVariableIntBlock(baseBlockSize=98), id=MockVariableIntBlock(baseBlockSize=98), name=MockVariableIntBlock(baseBlockSize=98)}, sim=DefaultSimilarity, locale=el, timezone=Europe/Moscow
[junit4:junit4] 2> NOTE: Windows 7 6.1 x86/Oracle Corporation 1.7.0_05 (32-bit)/cpus=2,threads=1,free=165144848,total=267452416
[junit4:junit4] 2> NOTE: All tests run in this JVM: [.SimpleFacetsTest, TestReload, SoftAutoCommitTest, TestSolrQueryParser, TestStressLucene, ZkNodePropsTest, DateMathParserTest, TestSolrDeletionPolicy2, SpellCheckCollatorTest, FullSolrCloudDistribCmdsTest, SpellCheckComponentTest, DebugComponentTest, TestCSVLoader, LeaderElectionIntegrationTest, FieldAnalysisRequestHandlerTest, PluginInfoTest, TestStressReorder, CacheHeaderTest, TestPropInjectDefaults, TestRangeQuery, TestRealTimeGet, RequiredFieldsTest, CSVRequestHandlerTest, TestPhraseSuggestions, LeaderElectionTest, LoggingHandlerTest, StandardRequestHandlerTest, TestGroupingSearch, DirectSolrConnectionTest, TestRecovery, TestSearchPerf, TestBadConfig, CurrencyFieldTest, TestIndexingPerformance, SuggesterTest, ResourceLoaderTest, TestCodecSupport, TestSuggestSpellingConverter, UUIDFieldTest, DistanceFunctionTest, TestArbitraryIndexDir, TestQuerySenderNoQuery, DOMUtilTest, QueryEqualityTest, TestIndexSearcher, TestPluginEnable, SearchHandlerTest, JSONWriterTest, CircularListTest, TestQueryTypes, SolrCoreCheckLockOnStartupTest, TestQuerySenderListener, TestReversedWildcardFilterFactory, EchoParamsTest, HighlighterConfigTest, TimeZoneUtilsTest, BasicZkTest, FieldMutatingUpdateProcessorTest, SolrIndexConfigTest, BasicFunctionalityTest, JsonLoaderTest, TestFaceting, SolrCmdDistributorTest, SolrInfoMBeanTest, RecoveryZkTest, PrimitiveFieldTypeTest, DocumentAnalysisRequestHandlerTest, FileUtilsTest, TestFoldingMultitermQuery, TestTrie, TestBinaryField, CoreContainerCoreInitFailuresTest, TestValueSourceCache, ConvertedLegacyTest, TestHashPartitioner, TestOmitPositions, PathHierarchyTokenizerFactoryTest, DistributedSpellCheckComponentTest, TestDefaultSimilarityFactory, TestSurroundQueryParser, HighlighterTest, FastVectorHighlighterTest, TestStressVersions, TestSolrXMLSerializer, QueryParsingTest, DistributedTermsComponentTest, TestNumberUtils, AlternateDirectoryTest, TestSolrDeletionPolicy1, DirectUpdateHandlerOptimizeTest, TestSolrCoreProperties, DirectSolrSpellCheckerTest, TestMergePolicyConfig, IndexSchemaRuntimeFieldTest, TestRTGBase, WordBreakSolrSpellCheckerTest, TestConfig, OverseerTest, TestQueryUtils, TestCoreContainer, SuggesterTSTTest, SignatureUpdateProcessorFactoryTest, DisMaxRequestHandlerTest, OpenExchangeRatesOrgProviderTest, BasicDistributedZkTest, TestReplicationHandler]
[junit4:junit4] 2> NOTE: reproduce with: ant test -Dtestcase=TestReplicationHandler -Dtests.seed=52390432AE74C307 -Dtests.slow=true -Dtests.locale=el -Dtests.timezone=Europe/Moscow -Dtests.file.encoding=ISO-8859-1
[junit4:junit4] 2>
[junit4:junit4] ERROR 0.00s | TestReplicationHandler (suite)
[junit4:junit4] > Throwable #1: java.lang.AssertionError: ERROR: SolrIndexSearcher opens=76 closes=75
[junit4:junit4] > at __randomizedtesting.SeedInfo.seed([52390432AE74C307]:0)
[junit4:junit4] > at org.junit.Assert.fail(Assert.java:93)
[junit4:junit4] > at org.apache.solr.SolrTestCaseJ4.endTrackingSearchers(SolrTestCaseJ4.java:216)
[junit4:junit4] > at org.apache.solr.SolrTestCaseJ4.afterClass(SolrTestCaseJ4.java:82)
[junit4:junit4] > at sun.reflect.GeneratedMethodAccessor15.invoke(Unknown Source)
[junit4:junit4] > at sun.reflect.DelegatingMethodAccessorImpl.invoke(DelegatingMethodAccessorImpl.java:43)
[junit4:junit4] > at java.lang.reflect.Method.invoke(Method.java:601)
[junit4:junit4] > at com.carrotsearch.randomizedtesting.RandomizedRunner.invoke(RandomizedRunner.java:1995)
[junit4:junit4] > at com.carrotsearch.randomizedtesting.RandomizedRunner.access$1100(RandomizedRunner.java:132)
[junit4:junit4] > at com.carrotsearch.randomizedtesting.RandomizedRunner$5.evaluate(RandomizedRunner.java:754)
[junit4:junit4] > at com.carrotsearch.randomizedtesting.rules.SystemPropertiesRestoreRule$1.evaluate(SystemPropertiesRestoreRule.java:53)
[junit4:junit4] > at org.apache.lucene.util.AbstractBeforeAfterRule$1.evaluate(AbstractBeforeAfterRule.java:45)
[junit4:junit4] > at org.apache.lucene.util.TestRuleReportUncaughtExceptions$1.evaluate(TestRuleReportUncaughtExceptions.java:68)
[junit4:junit4] > at org.apache.lucene.util.TestRuleStoreClassName$1.evaluate(TestRuleStoreClassName.java:38)
[junit4:junit4] > at com.carrotsearch.randomizedtesting.rules.SystemPropertiesInvariantRule$1.evaluate(SystemPropertiesInvariantRule.java:55)
[junit4:junit4] > at org.apache.lucene.util.TestRuleNoInstanceHooksOverrides$1.evaluate(TestRuleNoInstanceHooksOverrides.java:53)
[junit4:junit4] > at org.apache.lucene.util.TestRuleNoStaticHooksShadowing$1.evaluate(TestRuleNoStaticHooksShadowing.java:52)
[junit4:junit4] > at org.apache.lucene.util.TestRuleAssertionsRequired$1.evaluate(TestRuleAssertionsRequired.java:36)
[junit4:junit4] > at org.apache.lucene.util.TestRuleMarkFailure$1.evaluate(TestRuleMarkFailure.java:48)
[junit4:junit4] > at org.apache.lucene.util.TestRuleIgnoreAfterMaxFailures$1.evaluate(TestRuleIgnoreAfterMaxFailures.java:70)
[junit4:junit4] > at org.apache.lucene.util.TestRuleIgnoreTestSuites$1.evaluate(TestRuleIgnoreTestSuites.java:55)
[junit4:junit4] > at com.carrotsearch.randomizedtesting.RandomizedRunner.runSuite(RandomizedRunner.java:605)
[junit4:junit4] > at com.carrotsearch.randomizedtesting.RandomizedRunner.access$400(RandomizedRunner.java:132)
[junit4:junit4] > at com.carrotsearch.randomizedtesting.RandomizedRunner$2.run(RandomizedRunner.java:551)
[junit4:junit4] >
[junit4:junit4] Completed in 153.10s, 1 test, 1 failure <<< FAILURES!

[...truncated 347 lines...]
BUILD FAILED
C:\Jenkins\workspace\Lucene-Solr-trunk-Windows\build.xml:29: The following error occurred while executing this line:
C:\Jenkins\workspace\Lucene-Solr-trunk-Windows\solr\build.xml:144: The following error occurred while executing this line:
C:\Jenkins\workspace\Lucene-Solr-trunk-Windows\lucene\module-build.xml:62: The following error occurred while executing this line:
C:\Jenkins\workspace\Lucene-Solr-trunk-Windows\lucene\common-build.xml:1095: The following error occurred while executing this line:
C:\Jenkins\workspace\Lucene-Solr-trunk-Windows\lucene\common-build.xml:790: There were test failures: 224 suites, 901 tests, 1 suite-level error, 11 ignored (6 assumptions)

Total time: 34 minutes 3 seconds
Build step 'Invoke Ant' marked build as failure
Recording test results
Email was triggered for: Failure
Sending email for trigger: Failure

Lucene java-dev RSS feed   Index | Next | Previous | View Threaded
 
 


Interested in having your list archived? Contact Gossamer Threads
 
  Web Applications & Managed Hosting Powered by Gossamer Threads Inc.