Login | Register For Free | Help
Search for: (Advanced)

Mailing List Archive: Lucene: Java-Dev

[JENKINS] Lucene-Solr-4.x-Linux (32bit/jdk1.8.0-ea-b49) - Build # 112 - Failure!

 

 

Lucene java-dev RSS feed   Index | Next | Previous | View Threaded


jenkins at sd-datasolutions

Aug 2, 2012, 11:46 AM

Post #1 of 1 (73 views)
Permalink
[JENKINS] Lucene-Solr-4.x-Linux (32bit/jdk1.8.0-ea-b49) - Build # 112 - Failure!

Build: http://jenkins.sd-datasolutions.de/job/Lucene-Solr-4.x-Linux/112/
Java: 32bit/jdk1.8.0-ea-b49 -client -XX:+UseSerialGC

1 tests failed.
REGRESSION: org.apache.solr.handler.component.DistributedQueryElevationComponentTest.testDistribSearch

Error Message:
.responseHeader.params.size()==9,9skipped=4,5

Stack Trace:
junit.framework.AssertionFailedError: .responseHeader.params.size()==9,9skipped=4,5
at __randomizedtesting.SeedInfo.seed([124DC290FC523F4B:93AB4C888B0D5F77]:0)
at junit.framework.Assert.fail(Assert.java:50)
at org.apache.solr.BaseDistributedSearchTestCase.compareResponses(BaseDistributedSearchTestCase.java:670)
at org.apache.solr.BaseDistributedSearchTestCase.query(BaseDistributedSearchTestCase.java:392)
at org.apache.solr.handler.component.DistributedQueryElevationComponentTest.doTest(DistributedQueryElevationComponentTest.java:81)
at org.apache.solr.BaseDistributedSearchTestCase.testDistribSearch(BaseDistributedSearchTestCase.java:679)
at sun.reflect.NativeMethodAccessorImpl.invoke0(Native Method)
at sun.reflect.NativeMethodAccessorImpl.invoke(NativeMethodAccessorImpl.java:57)
at sun.reflect.DelegatingMethodAccessorImpl.invoke(DelegatingMethodAccessorImpl.java:43)
at java.lang.reflect.Method.invoke(Method.java:474)
at com.carrotsearch.randomizedtesting.RandomizedRunner.invoke(RandomizedRunner.java:1995)
at com.carrotsearch.randomizedtesting.RandomizedRunner.access$1100(RandomizedRunner.java:132)
at com.carrotsearch.randomizedtesting.RandomizedRunner$6.evaluate(RandomizedRunner.java:818)
at com.carrotsearch.randomizedtesting.RandomizedRunner$7.evaluate(RandomizedRunner.java:877)
at com.carrotsearch.randomizedtesting.RandomizedRunner$8.evaluate(RandomizedRunner.java:891)
at com.carrotsearch.randomizedtesting.rules.SystemPropertiesRestoreRule$1.evaluate(SystemPropertiesRestoreRule.java:53)
at org.apache.lucene.util.TestRuleSetupTeardownChained$1.evaluate(TestRuleSetupTeardownChained.java:50)
at org.apache.lucene.util.TestRuleFieldCacheSanity$1.evaluate(TestRuleFieldCacheSanity.java:32)
at org.apache.lucene.util.AbstractBeforeAfterRule$1.evaluate(AbstractBeforeAfterRule.java:45)
at com.carrotsearch.randomizedtesting.rules.SystemPropertiesInvariantRule$1.evaluate(SystemPropertiesInvariantRule.java:55)
at org.apache.lucene.util.TestRuleReportUncaughtExceptions$1.evaluate(TestRuleReportUncaughtExceptions.java:68)
at org.apache.lucene.util.TestRuleThreadAndTestName$1.evaluate(TestRuleThreadAndTestName.java:48)
at org.apache.lucene.util.TestRuleIgnoreAfterMaxFailures$1.evaluate(TestRuleIgnoreAfterMaxFailures.java:70)
at org.apache.lucene.util.TestRuleMarkFailure$1.evaluate(TestRuleMarkFailure.java:48)
at com.carrotsearch.randomizedtesting.RandomizedRunner.runSingleTest(RandomizedRunner.java:825)
at com.carrotsearch.randomizedtesting.RandomizedRunner.access$700(RandomizedRunner.java:132)
at com.carrotsearch.randomizedtesting.RandomizedRunner$3$1.run(RandomizedRunner.java:671)
at com.carrotsearch.randomizedtesting.RandomizedRunner$3.evaluate(RandomizedRunner.java:697)
at com.carrotsearch.randomizedtesting.RandomizedRunner$4.evaluate(RandomizedRunner.java:736)
at com.carrotsearch.randomizedtesting.RandomizedRunner$5.evaluate(RandomizedRunner.java:747)
at com.carrotsearch.randomizedtesting.rules.SystemPropertiesRestoreRule$1.evaluate(SystemPropertiesRestoreRule.java:53)
at org.apache.lucene.util.AbstractBeforeAfterRule$1.evaluate(AbstractBeforeAfterRule.java:45)
at org.apache.lucene.util.TestRuleReportUncaughtExceptions$1.evaluate(TestRuleReportUncaughtExceptions.java:68)
at org.apache.lucene.util.TestRuleStoreClassName$1.evaluate(TestRuleStoreClassName.java:38)
at com.carrotsearch.randomizedtesting.rules.SystemPropertiesInvariantRule$1.evaluate(SystemPropertiesInvariantRule.java:55)
at org.apache.lucene.util.TestRuleNoInstanceHooksOverrides$1.evaluate(TestRuleNoInstanceHooksOverrides.java:53)
at org.apache.lucene.util.TestRuleNoStaticHooksShadowing$1.evaluate(TestRuleNoStaticHooksShadowing.java:52)
at org.apache.lucene.util.TestRuleAssertionsRequired$1.evaluate(TestRuleAssertionsRequired.java:36)
at org.apache.lucene.util.TestRuleMarkFailure$1.evaluate(TestRuleMarkFailure.java:48)
at org.apache.lucene.util.TestRuleIgnoreAfterMaxFailures$1.evaluate(TestRuleIgnoreAfterMaxFailures.java:70)
at org.apache.lucene.util.TestRuleIgnoreTestSuites$1.evaluate(TestRuleIgnoreTestSuites.java:55)
at com.carrotsearch.randomizedtesting.RandomizedRunner.runSuite(RandomizedRunner.java:605)
at com.carrotsearch.randomizedtesting.RandomizedRunner.access$400(RandomizedRunner.java:132)
at com.carrotsearch.randomizedtesting.RandomizedRunner$2.run(RandomizedRunner.java:551)




Build Log:
[...truncated 7576 lines...]
[junit4:junit4] Suite: org.apache.solr.handler.component.DistributedQueryElevationComponentTest
[junit4:junit4] FAILURE 1.62s J1 | DistributedQueryElevationComponentTest.testDistribSearch
[junit4:junit4] > Throwable #1: junit.framework.AssertionFailedError: .responseHeader.params.size()==9,9skipped=4,5
[junit4:junit4] > at __randomizedtesting.SeedInfo.seed([124DC290FC523F4B:93AB4C888B0D5F77]:0)
[junit4:junit4] > at junit.framework.Assert.fail(Assert.java:50)
[junit4:junit4] > at org.apache.solr.BaseDistributedSearchTestCase.compareResponses(BaseDistributedSearchTestCase.java:670)
[junit4:junit4] > at org.apache.solr.BaseDistributedSearchTestCase.query(BaseDistributedSearchTestCase.java:392)
[junit4:junit4] > at org.apache.solr.handler.component.DistributedQueryElevationComponentTest.doTest(DistributedQueryElevationComponentTest.java:81)
[junit4:junit4] > at org.apache.solr.BaseDistributedSearchTestCase.testDistribSearch(BaseDistributedSearchTestCase.java:679)
[junit4:junit4] > at sun.reflect.NativeMethodAccessorImpl.invoke0(Native Method)
[junit4:junit4] > at sun.reflect.NativeMethodAccessorImpl.invoke(NativeMethodAccessorImpl.java:57)
[junit4:junit4] > at sun.reflect.DelegatingMethodAccessorImpl.invoke(DelegatingMethodAccessorImpl.java:43)
[junit4:junit4] > at java.lang.reflect.Method.invoke(Method.java:474)
[junit4:junit4] > at com.carrotsearch.randomizedtesting.RandomizedRunner.invoke(RandomizedRunner.java:1995)
[junit4:junit4] > at com.carrotsearch.randomizedtesting.RandomizedRunner.access$1100(RandomizedRunner.java:132)
[junit4:junit4] > at com.carrotsearch.randomizedtesting.RandomizedRunner$6.evaluate(RandomizedRunner.java:818)
[junit4:junit4] > at com.carrotsearch.randomizedtesting.RandomizedRunner$7.evaluate(RandomizedRunner.java:877)
[junit4:junit4] > at com.carrotsearch.randomizedtesting.RandomizedRunner$8.evaluate(RandomizedRunner.java:891)
[junit4:junit4] > at com.carrotsearch.randomizedtesting.rules.SystemPropertiesRestoreRule$1.evaluate(SystemPropertiesRestoreRule.java:53)
[junit4:junit4] > at org.apache.lucene.util.TestRuleSetupTeardownChained$1.evaluate(TestRuleSetupTeardownChained.java:50)
[junit4:junit4] > at org.apache.lucene.util.TestRuleFieldCacheSanity$1.evaluate(TestRuleFieldCacheSanity.java:32)
[junit4:junit4] > at org.apache.lucene.util.AbstractBeforeAfterRule$1.evaluate(AbstractBeforeAfterRule.java:45)
[junit4:junit4] > at com.carrotsearch.randomizedtesting.rules.SystemPropertiesInvariantRule$1.evaluate(SystemPropertiesInvariantRule.java:55)
[junit4:junit4] > at org.apache.lucene.util.TestRuleReportUncaughtExceptions$1.evaluate(TestRuleReportUncaughtExceptions.java:68)
[junit4:junit4] > at org.apache.lucene.util.TestRuleThreadAndTestName$1.evaluate(TestRuleThreadAndTestName.java:48)
[junit4:junit4] > at org.apache.lucene.util.TestRuleIgnoreAfterMaxFailures$1.evaluate(TestRuleIgnoreAfterMaxFailures.java:70)
[junit4:junit4] > at org.apache.lucene.util.TestRuleMarkFailure$1.evaluate(TestRuleMarkFailure.java:48)
[junit4:junit4] > at com.carrotsearch.randomizedtesting.RandomizedRunner.runSingleTest(RandomizedRunner.java:825)
[junit4:junit4] > at com.carrotsearch.randomizedtesting.RandomizedRunner.access$700(RandomizedRunner.java:132)
[junit4:junit4] > at com.carrotsearch.randomizedtesting.RandomizedRunner$3$1.run(RandomizedRunner.java:671)
[junit4:junit4] > at com.carrotsearch.randomizedtesting.RandomizedRunner$3.evaluate(RandomizedRunner.java:697)
[junit4:junit4] > at com.carrotsearch.randomizedtesting.RandomizedRunner$4.evaluate(RandomizedRunner.java:736)
[junit4:junit4] > at com.carrotsearch.randomizedtesting.RandomizedRunner$5.evaluate(RandomizedRunner.java:747)
[junit4:junit4] > at com.carrotsearch.randomizedtesting.rules.SystemPropertiesRestoreRule$1.evaluate(SystemPropertiesRestoreRule.java:53)
[junit4:junit4] > at org.apache.lucene.util.AbstractBeforeAfterRule$1.evaluate(AbstractBeforeAfterRule.java:45)
[junit4:junit4] > at org.apache.lucene.util.TestRuleReportUncaughtExceptions$1.evaluate(TestRuleReportUncaughtExceptions.java:68)
[junit4:junit4] > at org.apache.lucene.util.TestRuleStoreClassName$1.evaluate(TestRuleStoreClassName.java:38)
[junit4:junit4] > at com.carrotsearch.randomizedtesting.rules.SystemPropertiesInvariantRule$1.evaluate(SystemPropertiesInvariantRule.java:55)
[junit4:junit4] > at org.apache.lucene.util.TestRuleNoInstanceHooksOverrides$1.evaluate(TestRuleNoInstanceHooksOverrides.java:53)
[junit4:junit4] > at org.apache.lucene.util.TestRuleNoStaticHooksShadowing$1.evaluate(TestRuleNoStaticHooksShadowing.java:52)
[junit4:junit4] > at org.apache.lucene.util.TestRuleAssertionsRequired$1.evaluate(TestRuleAssertionsRequired.java:36)
[junit4:junit4] > at org.apache.lucene.util.TestRuleMarkFailure$1.evaluate(TestRuleMarkFailure.java:48)
[junit4:junit4] > at org.apache.lucene.util.TestRuleIgnoreAfterMaxFailures$1.evaluate(TestRuleIgnoreAfterMaxFailures.java:70)
[junit4:junit4] > at org.apache.lucene.util.TestRuleIgnoreTestSuites$1.evaluate(TestRuleIgnoreTestSuites.java:55)
[junit4:junit4] > at com.carrotsearch.randomizedtesting.RandomizedRunner.runSuite(RandomizedRunner.java:605)
[junit4:junit4] > at com.carrotsearch.randomizedtesting.RandomizedRunner.access$400(RandomizedRunner.java:132)
[junit4:junit4] > at com.carrotsearch.randomizedtesting.RandomizedRunner$2.run(RandomizedRunner.java:551)
[junit4:junit4] >
[junit4:junit4] 2> 1 T3139 oas.SolrTestCaseJ4.setUp ###Starting testDistribSearch
[junit4:junit4] 2> 2 T3139 oejs.Server.doStart jetty-8.1.2.v20120308
[junit4:junit4] 2> 4 T3139 oejs.AbstractConnector.doStart Started SocketConnector [at] 0:58209
[junit4:junit4] 2> 4 T3139 oasc.SolrResourceLoader.locateSolrHome JNDI not configured for solr (NoInitialContextEx)
[junit4:junit4] 2> 4 T3139 oasc.SolrResourceLoader.locateSolrHome using system property solr.solr.home: /mnt/ssd/jenkins/workspace/Lucene-Solr-4.x-Linux/checkout/solr/build/solr-core/test-files/solr
[junit4:junit4] 2> 5 T3139 oasc.SolrResourceLoader.<init> new SolrResourceLoader for deduced Solr Home: '/mnt/ssd/jenkins/workspace/Lucene-Solr-4.x-Linux/checkout/solr/build/solr-core/test-files/solr/'
[junit4:junit4] 2> 12 T3139 oass.SolrDispatchFilter.init SolrDispatchFilter.init()
[junit4:junit4] 2> 12 T3139 oasc.SolrResourceLoader.locateSolrHome JNDI not configured for solr (NoInitialContextEx)
[junit4:junit4] 2> 12 T3139 oasc.SolrResourceLoader.locateSolrHome using system property solr.solr.home: /mnt/ssd/jenkins/workspace/Lucene-Solr-4.x-Linux/checkout/solr/build/solr-core/test-files/solr
[junit4:junit4] 2> 12 T3139 oasc.CoreContainer$Initializer.initialize looking for solr.xml: /mnt/ssd/jenkins/workspace/Lucene-Solr-4.x-Linux/checkout/solr/build/solr-core/test-files/solr/solr.xml
[junit4:junit4] 2> 13 T3139 oasc.CoreContainer.<init> New CoreContainer 11238639
[junit4:junit4] 2> 13 T3139 oasc.CoreContainer.load Loading CoreContainer using Solr Home: '/mnt/ssd/jenkins/workspace/Lucene-Solr-4.x-Linux/checkout/solr/build/solr-core/test-files/solr/'
[junit4:junit4] 2> 13 T3139 oasc.SolrResourceLoader.<init> new SolrResourceLoader for directory: '/mnt/ssd/jenkins/workspace/Lucene-Solr-4.x-Linux/checkout/solr/build/solr-core/test-files/solr/'
[junit4:junit4] 2> 22 T3139 oasc.CoreContainer.load Registering Log Listener
[junit4:junit4] 2> 36 T3139 oasc.CoreContainer.create Creating SolrCore 'collection1' using instanceDir: /mnt/ssd/jenkins/workspace/Lucene-Solr-4.x-Linux/checkout/solr/build/solr-core/test-files/solr/collection1
[junit4:junit4] 2> 37 T3139 oasc.SolrResourceLoader.<init> new SolrResourceLoader for directory: '/mnt/ssd/jenkins/workspace/Lucene-Solr-4.x-Linux/checkout/solr/build/solr-core/test-files/solr/collection1/'
[junit4:junit4] 2> 37 T3139 oasc.SolrResourceLoader.replaceClassLoader Adding 'file:/mnt/ssd/jenkins/workspace/Lucene-Solr-4.x-Linux/checkout/solr/build/solr-core/test-files/solr/collection1/lib/README' to classloader
[junit4:junit4] 2> 37 T3139 oasc.SolrResourceLoader.replaceClassLoader Adding 'file:/mnt/ssd/jenkins/workspace/Lucene-Solr-4.x-Linux/checkout/solr/build/solr-core/test-files/solr/collection1/lib/classes/' to classloader
[junit4:junit4] 2> 58 T3139 oasc.SolrConfig.<init> Using Lucene MatchVersion: LUCENE_40
[junit4:junit4] 2> 99 T3139 oasc.SolrConfig.<init> Loaded SolrConfig: solrconfig-elevate.xml
[junit4:junit4] 2> 100 T3139 oass.IndexSchema.readSchema Reading Solr Schema
[junit4:junit4] 2> 102 T3139 oass.IndexSchema.readSchema Schema name=example
[junit4:junit4] 2> 271 T3139 oass.IndexSchema.readSchema default search field in schema is text
[junit4:junit4] 2> 274 T3139 oass.IndexSchema.readSchema unique key field: id
[junit4:junit4] 2> 278 T3139 oasc.SolrCore.<init> [collection1] Opening new SolrCore at /mnt/ssd/jenkins/workspace/Lucene-Solr-4.x-Linux/checkout/solr/build/solr-core/test-files/solr/collection1/, dataDir=./org.apache.solr.handler.component.DistributedQueryElevationComponentTest-1343933161216/control/data/
[junit4:junit4] 2> 278 T3139 oasc.JmxMonitoredMap.<init> JMX monitoring is enabled. Adding Solr mbeans to JMX Server: com.sun.jmx.mbeanserver.JmxMBeanServer [at] 1c13fc
[junit4:junit4] 2> 279 T3139 oasc.SolrCore.getNewIndexDir WARNING New index directory detected: old=null new=./org.apache.solr.handler.component.DistributedQueryElevationComponentTest-1343933161216/control/data/index/
[junit4:junit4] 2> 279 T3139 oasc.SolrCore.initIndex WARNING [collection1] Solr index directory './org.apache.solr.handler.component.DistributedQueryElevationComponentTest-1343933161216/control/data/index' doesn't exist. Creating new index...
[junit4:junit4] 2> 281 T3139 oasc.SolrDeletionPolicy.onCommit SolrDeletionPolicy.onCommit: commits:num=1
[junit4:junit4] 2> commit{dir=MockDirWrapper(NRTCachingDirectory(org.apache.lucene.store.RAMDirectory [at] 96b78 lockFactory=org.apache.lucene.store.SingleInstanceLockFactory [at] 2fd6d; maxCacheMB=0.1982421875 maxMergeSizeMB=0.390625)),segFN=segments_1,generation=1,filenames=[segments_1]
[junit4:junit4] 2> 281 T3139 oasc.SolrDeletionPolicy.updateCommits newest commit = 1
[junit4:junit4] 2> 283 T3139 oasc.RequestHandlers.initHandlersFromConfig created /update: solr.UpdateRequestHandler
[junit4:junit4] 2> 283 T3139 oasc.RequestHandlers.initHandlersFromConfig created /elevate: org.apache.solr.handler.component.SearchHandler
[junit4:junit4] 2> 283 T3139 oasc.RequestHandlers.initHandlersFromConfig created /dataElevate: org.apache.solr.handler.component.SearchHandler
[junit4:junit4] 2> 284 T3139 oashl.XMLLoader.init xsltCacheLifetimeSeconds=60
[junit4:junit4] 2> 284 T3139 oasc.RequestHandlers.initHandlersFromConfig WARNING no default request handler is registered (either '/select' or 'standard')
[junit4:junit4] 2> 286 T3139 oasc.SolrCore.initDeprecatedSupport WARNING solrconfig.xml uses deprecated <admin/gettableFiles>, Please update your config to use the ShowFileRequestHandler.
[junit4:junit4] 2> 287 T3139 oasc.SolrCore.initDeprecatedSupport WARNING adding ShowFileRequestHandler with hidden files: [.SOLRCONFIG-NOCACHE.XML, SOLRCONFIG-SPELLCHECKCOMPONENT.XML, SOLRCONFIG-QUERYSENDER-NOQUERY.XML, SOLRCONFIG-XINCLUDE.XML, SCHEMA-SIM.XML, STOPWORDS.TXT, SOLRCONFIG-REQHANDLER.INCL, BAD-SCHEMA-DUP-DYNAMICFIELD.XML, SCHEMA-LMJELINEKMERCER.XML, SCHEMA-MINIMAL.XML, SOLRCONFIG-SIMPLELOCK.XML, CURRENCY.XML, SOLRCONFIG-LAZYWRITER.XML, SCHEMA-FOLDING.XML, SCHEMA-REQUIRED-FIELDS.XML, SOLRCONFIG-CACHING.XML, THROW.ERROR.ON.ADD.UPDATEPROCESSOR.JS, SOLRCONFIG-ELEVATE.XML, SCHEMA12.XML, SOLRCONFIG-SCRIPT-UPDATEPROCESSOR.XML, MISSING.FUNCTIONS.UPDATEPROCESSOR.JS, BAD-SCHEMA-UNIQUEKEY-IS-COPYFIELD-DEST.XML, STOPWITHBOM.TXT, SOLRCONFIG_PERF.XML, SCHEMA-CHARFILTERS.XML, SOLRCONFIG-BASIC.XML, STOPTYPES-2.TXT, SCHEMA-IB.XML, SCHEMA-REPLICATION2.XML, FRENCHARTICLES.TXT, SCHEMA-SPELLCHECKER.XML, SOLRCONFIG-TLOG.XML, STOP-2.TXT, PROTWORDS.TXT, SCHEMA-NUMERIC.XML, SOLRCONFIG-ALTDIRECTORY.XML, SCHEMA-PHRASESUGGEST.XML, SCHEMA-REPLICATION1.XML, SCHEMA-BINARYFIELD.XML, BAD-SCHEMA-OMIT-TF-BUT-NOT-POS.XML, SOLRCONFIG-SLAVE1.XML, SOLRCONFIG-MASTER3.XML, XSLT, SOLRCONFIG-QUERYSENDER.XML, SOLRCONFIG-MASTER2.XML, SOLRCONFIG-FUNCTIONQUERY.XML, BAD-SCHEMA-DUP-FIELDTYPE.XML, DA_COMPOUNDDICTIONARY.TXT, STOPWORDSWRONGENCODING.TXT, SYNONYMS.TXT, SOLRCONFIG-PROPINJECT.XML, OPEN-EXCHANGE-RATES.JSON, BAD-SCHEMA-NOT-INDEXED-BUT-NORMS.XML, MISSLEADING.EXTENSION.UPDATEPROCESSOR.JS.TXT, SOLRCONFIG-SLAVE.XML, SOLRCONFIG-REPEATER.XML, BAD-SCHEMA-NOT-INDEXED-BUT-POS.XML, SOLRCONFIG-MASTER1.XML, SCHEMA11.XML, BAD-MP-SOLRCONFIG.XML, HUNSPELL-TEST.AFF, TRIVIAL.UPDATEPROCESSOR1.JS, SCHEMA-TFIDF.XML, COMPOUNDDICTIONARY.TXT, SOLRCONFIG-BASIC-LUCENEVERSION31.XML, SOLRCONFIG-NATIVELOCK.XML, BAD_SOLRCONFIG.XML, SCHEMA-NOT-REQUIRED-UNIQUE-KEY.XML, SCHEMA-LMDIRICHLET.XML, SCHEMA-DFR.XML, DA_UTF8.XML, BAD-SOLRCONFIG-BOGUS-SCRIPTENGINE-NAME.XML, SOLRCONFIG-DELPOLICY1.XML, BAD-SCHEMA-NOT-INDEXED-BUT-TF.XML, STOPTYPES-1.TXT, SCHEMA.XML, SCHEMA-COPYFIELD-TEST.XML, HYPHENATION.DTD, SCHEMA15.XML, OLD_SYNONYMS.TXT, TRIVIAL.UPDATEPROCESSOR0.JS, SCHEMA-LUCENEMATCHVERSION.XML, ADDFIELDS.UPDATEPROCESSOR.JS, SCHEMA_CODEC.XML, SCHEMA-BM25.XML, SOLRCONFIG-TERMINDEX.XML, SOLRCONFIG_CODEC.XML, SOLRCONFIG-PROPINJECT-INDEXDEFAULT.XML, STOP-SNOWBALL.TXT, SOLRCONFIG-DELPOLICY2.XML, SOLRCONFIG-MASTER1-KEEPONEBACKUP.XML, SOLRCONFIG-MASTER.XML, SCHEMA-COLLATEFILTER.XML, BAD-SCHEMA-CODEC-GLOBAL-VS-FT-MISMATCH.XML, STOP-1.TXT, SOLRCONFIG-PHRASESUGGEST.XML, BAD-SCHEMA-SIM-GLOBAL-VS-FT-MISMATCH.XML, BAD-SCHEMA-EXTERNAL-FILEFIELD.XML, BAD-SCHEMA-ANALYZER-CLASS-AND-NESTED.XML, BAD-SOLRCONFIG-MISSING-SCRIPTFILE.XML, ELEVATE.XML, SOLRCONFIG-MERGEPOLICY.XML, BAD-SCHEMA-NONTEXT-ANALYZER.XML, SOLRCONFIG-TRANSFORMERS.XML, BAD-SCHEMA-UNIQUEKEY-MULTIVALUED.XML, SCHEMA-TRIE.XML, PHRASESUGGEST.TXT, HUNSPELL-TEST.DIC, SOLRCONFIG-UPDATE-PROCESSOR-CHAINS.XML, KEEP-1.TXT, SCHEMA-COLLATE.XML, SCHEMA-REVERSED.XML, SOLRCONFIG-ENABLEPLUGIN.XML, BAD-SCHEMA-UNIQUEKEY-USES-DEFAULT.XML, SCHEMA-STOP-KEEP.XML, MAPPING-ISOLATIN1ACCENT.TXT, SOLRCONFIG-SOLR-749.XML, SOLRCONFIG-SOLCOREPROPERTIES.XML, SCHEMASURROUND.XML, WDFTYPES.TXT, SOLRCONFIG-HIGHLIGHT.XML, STEMDICT.TXT, BAD-SCHEMA-DUP-FIELD.XML, CONDITIONAL.UPDATEPROCESSOR.JS, BAD-SOLRCONFIG-INVALID-SCRIPTFILE.XML, SOLRCONFIG-SPELLCHECKER.XML, KEEP-2.TXT]
[junit4:junit4] 2> 290 T3139 oass.SolrIndexSearcher.<init> Opening Searcher [at] 5c9bb main
[junit4:junit4] 2> 291 T3139 oass.SolrIndexSearcher.getIndexDir WARNING WARNING: Directory impl does not support setting indexDir: org.apache.lucene.store.MockDirectoryWrapper
[junit4:junit4] 2> 291 T3139 oasu.CommitTracker.<init> Hard AutoCommit: disabled
[junit4:junit4] 2> 292 T3139 oasu.CommitTracker.<init> Soft AutoCommit: disabled
[junit4:junit4] 2> 292 T3139 oashc.QueryElevationComponent.inform Loading QueryElevation from: /mnt/ssd/jenkins/workspace/Lucene-Solr-4.x-Linux/checkout/solr/build/solr-core/test-files/solr/collection1/conf/elevate.xml
[junit4:junit4] 2> 302 T3139 oashc.QueryElevationComponent.inform Loading QueryElevation from: /mnt/ssd/jenkins/workspace/Lucene-Solr-4.x-Linux/checkout/solr/build/solr-core/test-files/solr/collection1/conf/elevate.xml
[junit4:junit4] 2> 312 T3139 oashc.HttpShardHandlerFactory.getParameter Setting socketTimeout to: 0
[junit4:junit4] 2> 312 T3139 oashc.HttpShardHandlerFactory.getParameter Setting urlScheme to: http://
[junit4:junit4] 2> 312 T3139 oashc.HttpShardHandlerFactory.getParameter Setting connTimeout to: 0
[junit4:junit4] 2> 313 T3139 oashc.HttpShardHandlerFactory.getParameter Setting maxConnectionsPerHost to: 20
[junit4:junit4] 2> 313 T3139 oashc.HttpShardHandlerFactory.getParameter Setting corePoolSize to: 0
[junit4:junit4] 2> 313 T3139 oashc.HttpShardHandlerFactory.getParameter Setting maximumPoolSize to: 2147483647
[junit4:junit4] 2> 314 T3139 oashc.HttpShardHandlerFactory.getParameter Setting maxThreadIdleTime to: 5
[junit4:junit4] 2> 314 T3139 oashc.HttpShardHandlerFactory.getParameter Setting sizeOfQueue to: -1
[junit4:junit4] 2> 314 T3139 oashc.HttpShardHandlerFactory.getParameter Setting fairnessPolicy to: false
[junit4:junit4] 2> 315 T3139 oascsi.HttpClientUtil.createClient Creating new http client, config:maxConnectionsPerHost=20&maxConnections=10000&socketTimeout=0&connTimeout=0&retry=false
[junit4:junit4] 2> 318 T3149 oasc.SolrCore.registerSearcher [collection1] Registered new searcher Searcher [at] 5c9bb main{StandardDirectoryReader(segments_1:1)}
[junit4:junit4] 2> 319 T3139 oasc.CoreContainer.register registering core: collection1
[junit4:junit4] 2> 319 T3139 oass.SolrDispatchFilter.init user.dir=/mnt/ssd/jenkins/workspace/Lucene-Solr-4.x-Linux/checkout/solr/build/solr-core/test/J1
[junit4:junit4] 2> 319 T3139 oass.SolrDispatchFilter.init SolrDispatchFilter.init() done
[junit4:junit4] 2> 320 T3139 oascsi.HttpClientUtil.createClient Creating new http client, config:maxConnections=128&maxConnectionsPerHost=32&followRedirects=false
[junit4:junit4] 2> 323 T3139 oejs.Server.doStart jetty-8.1.2.v20120308
[junit4:junit4] 2> 329 T3139 oejs.AbstractConnector.doStart Started SocketConnector [at] 0:58598
[junit4:junit4] 2> 330 T3139 oasc.SolrResourceLoader.locateSolrHome JNDI not configured for solr (NoInitialContextEx)
[junit4:junit4] 2> 330 T3139 oasc.SolrResourceLoader.locateSolrHome using system property solr.solr.home: /mnt/ssd/jenkins/workspace/Lucene-Solr-4.x-Linux/checkout/solr/build/solr-core/test-files/solr
[junit4:junit4] 2> 331 T3139 oasc.SolrResourceLoader.<init> new SolrResourceLoader for deduced Solr Home: '/mnt/ssd/jenkins/workspace/Lucene-Solr-4.x-Linux/checkout/solr/build/solr-core/test-files/solr/'
[junit4:junit4] 2> 341 T3139 oass.SolrDispatchFilter.init SolrDispatchFilter.init()
[junit4:junit4] 2> 342 T3139 oasc.SolrResourceLoader.locateSolrHome JNDI not configured for solr (NoInitialContextEx)
[junit4:junit4] 2> 342 T3139 oasc.SolrResourceLoader.locateSolrHome using system property solr.solr.home: /mnt/ssd/jenkins/workspace/Lucene-Solr-4.x-Linux/checkout/solr/build/solr-core/test-files/solr
[junit4:junit4] 2> 342 T3139 oasc.CoreContainer$Initializer.initialize looking for solr.xml: /mnt/ssd/jenkins/workspace/Lucene-Solr-4.x-Linux/checkout/solr/build/solr-core/test-files/solr/solr.xml
[junit4:junit4] 2> 342 T3139 oasc.CoreContainer.<init> New CoreContainer 30038032
[junit4:junit4] 2> 343 T3139 oasc.CoreContainer.load Loading CoreContainer using Solr Home: '/mnt/ssd/jenkins/workspace/Lucene-Solr-4.x-Linux/checkout/solr/build/solr-core/test-files/solr/'
[junit4:junit4] 2> 343 T3139 oasc.SolrResourceLoader.<init> new SolrResourceLoader for directory: '/mnt/ssd/jenkins/workspace/Lucene-Solr-4.x-Linux/checkout/solr/build/solr-core/test-files/solr/'
[junit4:junit4] 2> 356 T3139 oasc.CoreContainer.load Registering Log Listener
[junit4:junit4] 2> 373 T3139 oasc.CoreContainer.create Creating SolrCore 'collection1' using instanceDir: /mnt/ssd/jenkins/workspace/Lucene-Solr-4.x-Linux/checkout/solr/build/solr-core/test-files/solr/collection1
[junit4:junit4] 2> 374 T3139 oasc.SolrResourceLoader.<init> new SolrResourceLoader for directory: '/mnt/ssd/jenkins/workspace/Lucene-Solr-4.x-Linux/checkout/solr/build/solr-core/test-files/solr/collection1/'
[junit4:junit4] 2> 374 T3139 oasc.SolrResourceLoader.replaceClassLoader Adding 'file:/mnt/ssd/jenkins/workspace/Lucene-Solr-4.x-Linux/checkout/solr/build/solr-core/test-files/solr/collection1/lib/README' to classloader
[junit4:junit4] 2> 375 T3139 oasc.SolrResourceLoader.replaceClassLoader Adding 'file:/mnt/ssd/jenkins/workspace/Lucene-Solr-4.x-Linux/checkout/solr/build/solr-core/test-files/solr/collection1/lib/classes/' to classloader
[junit4:junit4] 2> 407 T3139 oasc.SolrConfig.<init> Using Lucene MatchVersion: LUCENE_40
[junit4:junit4] 2> 463 T3139 oasc.SolrConfig.<init> Loaded SolrConfig: solrconfig-elevate.xml
[junit4:junit4] 2> 464 T3139 oass.IndexSchema.readSchema Reading Solr Schema
[junit4:junit4] 2> 468 T3139 oass.IndexSchema.readSchema Schema name=example
[junit4:junit4] 2> 645 T3139 oass.IndexSchema.readSchema default search field in schema is text
[junit4:junit4] 2> 647 T3139 oass.IndexSchema.readSchema unique key field: id
[junit4:junit4] 2> 649 T3139 oasc.SolrCore.<init> [collection1] Opening new SolrCore at /mnt/ssd/jenkins/workspace/Lucene-Solr-4.x-Linux/checkout/solr/build/solr-core/test-files/solr/collection1/, dataDir=./org.apache.solr.handler.component.DistributedQueryElevationComponentTest-1343933161216/shard0/data/
[junit4:junit4] 2> 649 T3139 oasc.JmxMonitoredMap.<init> JMX monitoring is enabled. Adding Solr mbeans to JMX Server: com.sun.jmx.mbeanserver.JmxMBeanServer [at] 1c13fc
[junit4:junit4] 2> 650 T3139 oasc.SolrCore.getNewIndexDir WARNING New index directory detected: old=null new=./org.apache.solr.handler.component.DistributedQueryElevationComponentTest-1343933161216/shard0/data/index/
[junit4:junit4] 2> 650 T3139 oasc.SolrCore.initIndex WARNING [collection1] Solr index directory './org.apache.solr.handler.component.DistributedQueryElevationComponentTest-1343933161216/shard0/data/index' doesn't exist. Creating new index...
[junit4:junit4] 2> 651 T3139 oasc.SolrDeletionPolicy.onCommit SolrDeletionPolicy.onCommit: commits:num=1
[junit4:junit4] 2> commit{dir=MockDirWrapper(NRTCachingDirectory(org.apache.lucene.store.RAMDirectory [at] 15c260 lockFactory=org.apache.lucene.store.SingleInstanceLockFactory [at] 78c43; maxCacheMB=0.2705078125 maxMergeSizeMB=0.8173828125)),segFN=segments_1,generation=1,filenames=[segments_1]
[junit4:junit4] 2> 651 T3139 oasc.SolrDeletionPolicy.updateCommits newest commit = 1
[junit4:junit4] 2> 652 T3139 oasc.RequestHandlers.initHandlersFromConfig created /update: solr.UpdateRequestHandler
[junit4:junit4] 2> 652 T3139 oasc.RequestHandlers.initHandlersFromConfig created /elevate: org.apache.solr.handler.component.SearchHandler
[junit4:junit4] 2> 653 T3139 oasc.RequestHandlers.initHandlersFromConfig created /dataElevate: org.apache.solr.handler.component.SearchHandler
[junit4:junit4] 2> 653 T3139 oashl.XMLLoader.init xsltCacheLifetimeSeconds=60
[junit4:junit4] 2> 653 T3139 oasc.RequestHandlers.initHandlersFromConfig WARNING no default request handler is registered (either '/select' or 'standard')
[junit4:junit4] 2> 654 T3139 oasc.SolrCore.initDeprecatedSupport WARNING solrconfig.xml uses deprecated <admin/gettableFiles>, Please update your config to use the ShowFileRequestHandler.
[junit4:junit4] 2> 655 T3139 oasc.SolrCore.initDeprecatedSupport WARNING adding ShowFileRequestHandler with hidden files: [.SOLRCONFIG-NOCACHE.XML, SOLRCONFIG-SPELLCHECKCOMPONENT.XML, SOLRCONFIG-QUERYSENDER-NOQUERY.XML, SOLRCONFIG-XINCLUDE.XML, SCHEMA-SIM.XML, STOPWORDS.TXT, SOLRCONFIG-REQHANDLER.INCL, BAD-SCHEMA-DUP-DYNAMICFIELD.XML, SCHEMA-LMJELINEKMERCER.XML, SCHEMA-MINIMAL.XML, SOLRCONFIG-SIMPLELOCK.XML, CURRENCY.XML, SOLRCONFIG-LAZYWRITER.XML, SCHEMA-FOLDING.XML, SCHEMA-REQUIRED-FIELDS.XML, SOLRCONFIG-CACHING.XML, THROW.ERROR.ON.ADD.UPDATEPROCESSOR.JS, SOLRCONFIG-ELEVATE.XML, SCHEMA12.XML, SOLRCONFIG-SCRIPT-UPDATEPROCESSOR.XML, MISSING.FUNCTIONS.UPDATEPROCESSOR.JS, BAD-SCHEMA-UNIQUEKEY-IS-COPYFIELD-DEST.XML, STOPWITHBOM.TXT, SOLRCONFIG_PERF.XML, SCHEMA-CHARFILTERS.XML, SOLRCONFIG-BASIC.XML, STOPTYPES-2.TXT, SCHEMA-IB.XML, SCHEMA-REPLICATION2.XML, FRENCHARTICLES.TXT, SCHEMA-SPELLCHECKER.XML, SOLRCONFIG-TLOG.XML, STOP-2.TXT, PROTWORDS.TXT, SCHEMA-NUMERIC.XML, SOLRCONFIG-ALTDIRECTORY.XML, SCHEMA-PHRASESUGGEST.XML, SCHEMA-REPLICATION1.XML, SCHEMA-BINARYFIELD.XML, BAD-SCHEMA-OMIT-TF-BUT-NOT-POS.XML, SOLRCONFIG-SLAVE1.XML, SOLRCONFIG-MASTER3.XML, XSLT, SOLRCONFIG-QUERYSENDER.XML, SOLRCONFIG-MASTER2.XML, SOLRCONFIG-FUNCTIONQUERY.XML, BAD-SCHEMA-DUP-FIELDTYPE.XML, DA_COMPOUNDDICTIONARY.TXT, STOPWORDSWRONGENCODING.TXT, SYNONYMS.TXT, SOLRCONFIG-PROPINJECT.XML, OPEN-EXCHANGE-RATES.JSON, BAD-SCHEMA-NOT-INDEXED-BUT-NORMS.XML, MISSLEADING.EXTENSION.UPDATEPROCESSOR.JS.TXT, SOLRCONFIG-SLAVE.XML, SOLRCONFIG-REPEATER.XML, BAD-SCHEMA-NOT-INDEXED-BUT-POS.XML, SOLRCONFIG-MASTER1.XML, SCHEMA11.XML, BAD-MP-SOLRCONFIG.XML, HUNSPELL-TEST.AFF, TRIVIAL.UPDATEPROCESSOR1.JS, SCHEMA-TFIDF.XML, COMPOUNDDICTIONARY.TXT, SOLRCONFIG-BASIC-LUCENEVERSION31.XML, SOLRCONFIG-NATIVELOCK.XML, BAD_SOLRCONFIG.XML, SCHEMA-NOT-REQUIRED-UNIQUE-KEY.XML, SCHEMA-LMDIRICHLET.XML, SCHEMA-DFR.XML, DA_UTF8.XML, BAD-SOLRCONFIG-BOGUS-SCRIPTENGINE-NAME.XML, SOLRCONFIG-DELPOLICY1.XML, BAD-SCHEMA-NOT-INDEXED-BUT-TF.XML, STOPTYPES-1.TXT, SCHEMA.XML, SCHEMA-COPYFIELD-TEST.XML, HYPHENATION.DTD, SCHEMA15.XML, OLD_SYNONYMS.TXT, TRIVIAL.UPDATEPROCESSOR0.JS, SCHEMA-LUCENEMATCHVERSION.XML, ADDFIELDS.UPDATEPROCESSOR.JS, SCHEMA_CODEC.XML, SCHEMA-BM25.XML, SOLRCONFIG-TERMINDEX.XML, SOLRCONFIG_CODEC.XML, SOLRCONFIG-PROPINJECT-INDEXDEFAULT.XML, STOP-SNOWBALL.TXT, SOLRCONFIG-DELPOLICY2.XML, SOLRCONFIG-MASTER1-KEEPONEBACKUP.XML, SOLRCONFIG-MASTER.XML, SCHEMA-COLLATEFILTER.XML, BAD-SCHEMA-CODEC-GLOBAL-VS-FT-MISMATCH.XML, STOP-1.TXT, SOLRCONFIG-PHRASESUGGEST.XML, BAD-SCHEMA-SIM-GLOBAL-VS-FT-MISMATCH.XML, BAD-SCHEMA-EXTERNAL-FILEFIELD.XML, BAD-SCHEMA-ANALYZER-CLASS-AND-NESTED.XML, BAD-SOLRCONFIG-MISSING-SCRIPTFILE.XML, ELEVATE.XML, SOLRCONFIG-MERGEPOLICY.XML, BAD-SCHEMA-NONTEXT-ANALYZER.XML, SOLRCONFIG-TRANSFORMERS.XML, BAD-SCHEMA-UNIQUEKEY-MULTIVALUED.XML, SCHEMA-TRIE.XML, PHRASESUGGEST.TXT, HUNSPELL-TEST.DIC, SOLRCONFIG-UPDATE-PROCESSOR-CHAINS.XML, KEEP-1.TXT, SCHEMA-COLLATE.XML, SCHEMA-REVERSED.XML, SOLRCONFIG-ENABLEPLUGIN.XML, BAD-SCHEMA-UNIQUEKEY-USES-DEFAULT.XML, SCHEMA-STOP-KEEP.XML, MAPPING-ISOLATIN1ACCENT.TXT, SOLRCONFIG-SOLR-749.XML, SOLRCONFIG-SOLCOREPROPERTIES.XML, SCHEMASURROUND.XML, WDFTYPES.TXT, SOLRCONFIG-HIGHLIGHT.XML, STEMDICT.TXT, BAD-SCHEMA-DUP-FIELD.XML, CONDITIONAL.UPDATEPROCESSOR.JS, BAD-SOLRCONFIG-INVALID-SCRIPTFILE.XML, SOLRCONFIG-SPELLCHECKER.XML, KEEP-2.TXT]
[junit4:junit4] 2> 657 T3139 oass.SolrIndexSearcher.<init> Opening Searcher [at] 1be408 main
[junit4:junit4] 2> 658 T3139 oass.SolrIndexSearcher.getIndexDir WARNING WARNING: Directory impl does not support setting indexDir: org.apache.lucene.store.MockDirectoryWrapper
[junit4:junit4] 2> 658 T3139 oasu.CommitTracker.<init> Hard AutoCommit: disabled
[junit4:junit4] 2> 658 T3139 oasu.CommitTracker.<init> Soft AutoCommit: disabled
[junit4:junit4] 2> 659 T3139 oashc.QueryElevationComponent.inform Loading QueryElevation from: /mnt/ssd/jenkins/workspace/Lucene-Solr-4.x-Linux/checkout/solr/build/solr-core/test-files/solr/collection1/conf/elevate.xml
[junit4:junit4] 2> 665 T3139 oashc.QueryElevationComponent.inform Loading QueryElevation from: /mnt/ssd/jenkins/workspace/Lucene-Solr-4.x-Linux/checkout/solr/build/solr-core/test-files/solr/collection1/conf/elevate.xml
[junit4:junit4] 2> 671 T3139 oashc.HttpShardHandlerFactory.getParameter Setting socketTimeout to: 0
[junit4:junit4] 2> 672 T3139 oashc.HttpShardHandlerFactory.getParameter Setting urlScheme to: http://
[junit4:junit4] 2> 672 T3139 oashc.HttpShardHandlerFactory.getParameter Setting connTimeout to: 0
[junit4:junit4] 2> 672 T3139 oashc.HttpShardHandlerFactory.getParameter Setting maxConnectionsPerHost to: 20
[junit4:junit4] 2> 672 T3139 oashc.HttpShardHandlerFactory.getParameter Setting corePoolSize to: 0
[junit4:junit4] 2> 672 T3139 oashc.HttpShardHandlerFactory.getParameter Setting maximumPoolSize to: 2147483647
[junit4:junit4] 2> 673 T3139 oashc.HttpShardHandlerFactory.getParameter Setting maxThreadIdleTime to: 5
[junit4:junit4] 2> 673 T3139 oashc.HttpShardHandlerFactory.getParameter Setting sizeOfQueue to: -1
[junit4:junit4] 2> 673 T3139 oashc.HttpShardHandlerFactory.getParameter Setting fairnessPolicy to: false
[junit4:junit4] 2> 673 T3139 oascsi.HttpClientUtil.createClient Creating new http client, config:maxConnectionsPerHost=20&maxConnections=10000&socketTimeout=0&connTimeout=0&retry=false
[junit4:junit4] 2> 676 T3139 oasc.CoreContainer.register registering core: collection1
[junit4:junit4] 2> 676 T3159 oasc.SolrCore.registerSearcher [collection1] Registered new searcher Searcher [at] 1be408 main{StandardDirectoryReader(segments_1:1)}
[junit4:junit4] 2> 676 T3139 oass.SolrDispatchFilter.init user.dir=/mnt/ssd/jenkins/workspace/Lucene-Solr-4.x-Linux/checkout/solr/build/solr-core/test/J1
[junit4:junit4] 2> 676 T3139 oass.SolrDispatchFilter.init SolrDispatchFilter.init() done
[junit4:junit4] 2> 677 T3139 oascsi.HttpClientUtil.createClient Creating new http client, config:maxConnections=128&maxConnectionsPerHost=32&followRedirects=false
[junit4:junit4] 2> 679 T3139 oejs.Server.doStart jetty-8.1.2.v20120308
[junit4:junit4] 2> 680 T3139 oejs.AbstractConnector.doStart Started SocketConnector [at] 0:52572
[junit4:junit4] 2> 681 T3139 oasc.SolrResourceLoader.locateSolrHome JNDI not configured for solr (NoInitialContextEx)
[junit4:junit4] 2> 681 T3139 oasc.SolrResourceLoader.locateSolrHome using system property solr.solr.home: /mnt/ssd/jenkins/workspace/Lucene-Solr-4.x-Linux/checkout/solr/build/solr-core/test-files/solr
[junit4:junit4] 2> 681 T3139 oasc.SolrResourceLoader.<init> new SolrResourceLoader for deduced Solr Home: '/mnt/ssd/jenkins/workspace/Lucene-Solr-4.x-Linux/checkout/solr/build/solr-core/test-files/solr/'
[junit4:junit4] 2> 688 T3139 oass.SolrDispatchFilter.init SolrDispatchFilter.init()
[junit4:junit4] 2> 688 T3139 oasc.SolrResourceLoader.locateSolrHome JNDI not configured for solr (NoInitialContextEx)
[junit4:junit4] 2> 689 T3139 oasc.SolrResourceLoader.locateSolrHome using system property solr.solr.home: /mnt/ssd/jenkins/workspace/Lucene-Solr-4.x-Linux/checkout/solr/build/solr-core/test-files/solr
[junit4:junit4] 2> 689 T3139 oasc.CoreContainer$Initializer.initialize looking for solr.xml: /mnt/ssd/jenkins/workspace/Lucene-Solr-4.x-Linux/checkout/solr/build/solr-core/test-files/solr/solr.xml
[junit4:junit4] 2> 689 T3139 oasc.CoreContainer.<init> New CoreContainer 12785723
[junit4:junit4] 2> 689 T3139 oasc.CoreContainer.load Loading CoreContainer using Solr Home: '/mnt/ssd/jenkins/workspace/Lucene-Solr-4.x-Linux/checkout/solr/build/solr-core/test-files/solr/'
[junit4:junit4] 2> 690 T3139 oasc.SolrResourceLoader.<init> new SolrResourceLoader for directory: '/mnt/ssd/jenkins/workspace/Lucene-Solr-4.x-Linux/checkout/solr/build/solr-core/test-files/solr/'
[junit4:junit4] 2> 700 T3139 oasc.CoreContainer.load Registering Log Listener
[junit4:junit4] 2> 719 T3139 oasc.CoreContainer.create Creating SolrCore 'collection1' using instanceDir: /mnt/ssd/jenkins/workspace/Lucene-Solr-4.x-Linux/checkout/solr/build/solr-core/test-files/solr/collection1
[junit4:junit4] 2> 719 T3139 oasc.SolrResourceLoader.<init> new SolrResourceLoader for directory: '/mnt/ssd/jenkins/workspace/Lucene-Solr-4.x-Linux/checkout/solr/build/solr-core/test-files/solr/collection1/'
[junit4:junit4] 2> 720 T3139 oasc.SolrResourceLoader.replaceClassLoader Adding 'file:/mnt/ssd/jenkins/workspace/Lucene-Solr-4.x-Linux/checkout/solr/build/solr-core/test-files/solr/collection1/lib/README' to classloader
[junit4:junit4] 2> 720 T3139 oasc.SolrResourceLoader.replaceClassLoader Adding 'file:/mnt/ssd/jenkins/workspace/Lucene-Solr-4.x-Linux/checkout/solr/build/solr-core/test-files/solr/collection1/lib/classes/' to classloader
[junit4:junit4] 2> 741 T3139 oasc.SolrConfig.<init> Using Lucene MatchVersion: LUCENE_40
[junit4:junit4] 2> 759 T1990 oaz.ClientCnxn$SendThread.startConnect Opening socket connection to server localhost.localdomain/127.0.0.1:33813
[junit4:junit4] 2> 760 T1990 oaz.ClientCnxn$SendThread.run WARNING Session 0x138e8a532410010 for server null, unexpected error, closing socket connection and attempting reconnect java.net.ConnectException: Connection refused
[junit4:junit4] 2> at sun.nio.ch.SocketChannelImpl.checkConnect(Native Method)
[junit4:junit4] 2> at sun.nio.ch.SocketChannelImpl.finishConnect(SocketChannelImpl.java:692)
[junit4:junit4] 2> at org.apache.zookeeper.ClientCnxn$SendThread.run(ClientCnxn.java:1143)
[junit4:junit4] 2>
[junit4:junit4] 2> 775 T3139 oasc.SolrConfig.<init> Loaded SolrConfig: solrconfig-elevate.xml
[junit4:junit4] 2> 775 T3139 oass.IndexSchema.readSchema Reading Solr Schema
[junit4:junit4] 2> 784 T3139 oass.IndexSchema.readSchema Schema name=example
[junit4:junit4] 2> 937 T3139 oass.IndexSchema.readSchema default search field in schema is text
[junit4:junit4] 2> 939 T3139 oass.IndexSchema.readSchema unique key field: id
[junit4:junit4] 2> 941 T3139 oasc.SolrCore.<init> [collection1] Opening new SolrCore at /mnt/ssd/jenkins/workspace/Lucene-Solr-4.x-Linux/checkout/solr/build/solr-core/test-files/solr/collection1/, dataDir=./org.apache.solr.handler.component.DistributedQueryElevationComponentTest-1343933161216/shard1/data/
[junit4:junit4] 2> 942 T3139 oasc.JmxMonitoredMap.<init> JMX monitoring is enabled. Adding Solr mbeans to JMX Server: com.sun.jmx.mbeanserver.JmxMBeanServer [at] 1c13fc
[junit4:junit4] 2> 942 T3139 oasc.SolrCore.getNewIndexDir WARNING New index directory detected: old=null new=./org.apache.solr.handler.component.DistributedQueryElevationComponentTest-1343933161216/shard1/data/index/
[junit4:junit4] 2> 942 T3139 oasc.SolrCore.initIndex WARNING [collection1] Solr index directory './org.apache.solr.handler.component.DistributedQueryElevationComponentTest-1343933161216/shard1/data/index' doesn't exist. Creating new index...
[junit4:junit4] 2> 943 T3139 oasc.SolrDeletionPolicy.onCommit SolrDeletionPolicy.onCommit: commits:num=1
[junit4:junit4] 2> commit{dir=MockDirWrapper(org.apache.lucene.store.RAMDirectory [at] 1d3711 lockFactory=org.apache.lucene.store.SingleInstanceLockFactory [at] ada87),segFN=segments_1,generation=1,filenames=[segments_1]
[junit4:junit4] 2> 944 T3139 oasc.SolrDeletionPolicy.updateCommits newest commit = 1
[junit4:junit4] 2> 944 T3139 oasc.RequestHandlers.initHandlersFromConfig created /update: solr.UpdateRequestHandler
[junit4:junit4] 2> 945 T3139 oasc.RequestHandlers.initHandlersFromConfig created /elevate: org.apache.solr.handler.component.SearchHandler
[junit4:junit4] 2> 945 T3139 oasc.RequestHandlers.initHandlersFromConfig created /dataElevate: org.apache.solr.handler.component.SearchHandler
[junit4:junit4] 2> 945 T3139 oashl.XMLLoader.init xsltCacheLifetimeSeconds=60
[junit4:junit4] 2> 946 T3139 oasc.RequestHandlers.initHandlersFromConfig WARNING no default request handler is registered (either '/select' or 'standard')
[junit4:junit4] 2> 947 T3139 oasc.SolrCore.initDeprecatedSupport WARNING solrconfig.xml uses deprecated <admin/gettableFiles>, Please update your config to use the ShowFileRequestHandler.
[junit4:junit4] 2> 948 T3139 oasc.SolrCore.initDeprecatedSupport WARNING adding ShowFileRequestHandler with hidden files: [.SOLRCONFIG-NOCACHE.XML, SOLRCONFIG-SPELLCHECKCOMPONENT.XML, SOLRCONFIG-QUERYSENDER-NOQUERY.XML, SOLRCONFIG-XINCLUDE.XML, SCHEMA-SIM.XML, STOPWORDS.TXT, SOLRCONFIG-REQHANDLER.INCL, BAD-SCHEMA-DUP-DYNAMICFIELD.XML, SCHEMA-LMJELINEKMERCER.XML, SCHEMA-MINIMAL.XML, SOLRCONFIG-SIMPLELOCK.XML, CURRENCY.XML, SOLRCONFIG-LAZYWRITER.XML, SCHEMA-FOLDING.XML, SCHEMA-REQUIRED-FIELDS.XML, SOLRCONFIG-CACHING.XML, THROW.ERROR.ON.ADD.UPDATEPROCESSOR.JS, SOLRCONFIG-ELEVATE.XML, SCHEMA12.XML, SOLRCONFIG-SCRIPT-UPDATEPROCESSOR.XML, MISSING.FUNCTIONS.UPDATEPROCESSOR.JS, BAD-SCHEMA-UNIQUEKEY-IS-COPYFIELD-DEST.XML, STOPWITHBOM.TXT, SOLRCONFIG_PERF.XML, SCHEMA-CHARFILTERS.XML, SOLRCONFIG-BASIC.XML, STOPTYPES-2.TXT, SCHEMA-IB.XML, SCHEMA-REPLICATION2.XML, FRENCHARTICLES.TXT, SCHEMA-SPELLCHECKER.XML, SOLRCONFIG-TLOG.XML, STOP-2.TXT, PROTWORDS.TXT, SCHEMA-NUMERIC.XML, SOLRCONFIG-ALTDIRECTORY.XML, SCHEMA-PHRASESUGGEST.XML, SCHEMA-REPLICATION1.XML, SCHEMA-BINARYFIELD.XML, BAD-SCHEMA-OMIT-TF-BUT-NOT-POS.XML, SOLRCONFIG-SLAVE1.XML, SOLRCONFIG-MASTER3.XML, XSLT, SOLRCONFIG-QUERYSENDER.XML, SOLRCONFIG-MASTER2.XML, SOLRCONFIG-FUNCTIONQUERY.XML, BAD-SCHEMA-DUP-FIELDTYPE.XML, DA_COMPOUNDDICTIONARY.TXT, STOPWORDSWRONGENCODING.TXT, SYNONYMS.TXT, SOLRCONFIG-PROPINJECT.XML, OPEN-EXCHANGE-RATES.JSON, BAD-SCHEMA-NOT-INDEXED-BUT-NORMS.XML, MISSLEADING.EXTENSION.UPDATEPROCESSOR.JS.TXT, SOLRCONFIG-SLAVE.XML, SOLRCONFIG-REPEATER.XML, BAD-SCHEMA-NOT-INDEXED-BUT-POS.XML, SOLRCONFIG-MASTER1.XML, SCHEMA11.XML, BAD-MP-SOLRCONFIG.XML, HUNSPELL-TEST.AFF, TRIVIAL.UPDATEPROCESSOR1.JS, SCHEMA-TFIDF.XML, COMPOUNDDICTIONARY.TXT, SOLRCONFIG-BASIC-LUCENEVERSION31.XML, SOLRCONFIG-NATIVELOCK.XML, BAD_SOLRCONFIG.XML, SCHEMA-NOT-REQUIRED-UNIQUE-KEY.XML, SCHEMA-LMDIRICHLET.XML, SCHEMA-DFR.XML, DA_UTF8.XML, BAD-SOLRCONFIG-BOGUS-SCRIPTENGINE-NAME.XML, SOLRCONFIG-DELPOLICY1.XML, BAD-SCHEMA-NOT-INDEXED-BUT-TF.XML, STOPTYPES-1.TXT, SCHEMA.XML, SCHEMA-COPYFIELD-TEST.XML, HYPHENATION.DTD, SCHEMA15.XML, OLD_SYNONYMS.TXT, TRIVIAL.UPDATEPROCESSOR0.JS, SCHEMA-LUCENEMATCHVERSION.XML, ADDFIELDS.UPDATEPROCESSOR.JS, SCHEMA_CODEC.XML, SCHEMA-BM25.XML, SOLRCONFIG-TERMINDEX.XML, SOLRCONFIG_CODEC.XML, SOLRCONFIG-PROPINJECT-INDEXDEFAULT.XML, STOP-SNOWBALL.TXT, SOLRCONFIG-DELPOLICY2.XML, SOLRCONFIG-MASTER1-KEEPONEBACKUP.XML, SOLRCONFIG-MASTER.XML, SCHEMA-COLLATEFILTER.XML, BAD-SCHEMA-CODEC-GLOBAL-VS-FT-MISMATCH.XML, STOP-1.TXT, SOLRCONFIG-PHRASESUGGEST.XML, BAD-SCHEMA-SIM-GLOBAL-VS-FT-MISMATCH.XML, BAD-SCHEMA-EXTERNAL-FILEFIELD.XML, BAD-SCHEMA-ANALYZER-CLASS-AND-NESTED.XML, BAD-SOLRCONFIG-MISSING-SCRIPTFILE.XML, ELEVATE.XML, SOLRCONFIG-MERGEPOLICY.XML, BAD-SCHEMA-NONTEXT-ANALYZER.XML, SOLRCONFIG-TRANSFORMERS.XML, BAD-SCHEMA-UNIQUEKEY-MULTIVALUED.XML, SCHEMA-TRIE.XML, PHRASESUGGEST.TXT, HUNSPELL-TEST.DIC, SOLRCONFIG-UPDATE-PROCESSOR-CHAINS.XML, KEEP-1.TXT, SCHEMA-COLLATE.XML, SCHEMA-REVERSED.XML, SOLRCONFIG-ENABLEPLUGIN.XML, BAD-SCHEMA-UNIQUEKEY-USES-DEFAULT.XML, SCHEMA-STOP-KEEP.XML, MAPPING-ISOLATIN1ACCENT.TXT, SOLRCONFIG-SOLR-749.XML, SOLRCONFIG-SOLCOREPROPERTIES.XML, SCHEMASURROUND.XML, WDFTYPES.TXT, SOLRCONFIG-HIGHLIGHT.XML, STEMDICT.TXT, BAD-SCHEMA-DUP-FIELD.XML, CONDITIONAL.UPDATEPROCESSOR.JS, BAD-SOLRCONFIG-INVALID-SCRIPTFILE.XML, SOLRCONFIG-SPELLCHECKER.XML, KEEP-2.TXT]
[junit4:junit4] 2> 950 T3139 oass.SolrIndexSearcher.<init> Opening Searcher [at] 167ac5 main
[junit4:junit4] 2> 950 T3139 oass.SolrIndexSearcher.getIndexDir WARNING WARNING: Directory impl does not support setting indexDir: org.apache.lucene.store.MockDirectoryWrapper
[junit4:junit4] 2> 950 T3139 oasu.CommitTracker.<init> Hard AutoCommit: disabled
[junit4:junit4] 2> 951 T3139 oasu.CommitTracker.<init> Soft AutoCommit: disabled
[junit4:junit4] 2> 951 T3139 oashc.QueryElevationComponent.inform Loading QueryElevation from: /mnt/ssd/jenkins/workspace/Lucene-Solr-4.x-Linux/checkout/solr/build/solr-core/test-files/solr/collection1/conf/elevate.xml
[junit4:junit4] 2> 957 T3139 oashc.QueryElevationComponent.inform Loading QueryElevation from: /mnt/ssd/jenkins/workspace/Lucene-Solr-4.x-Linux/checkout/solr/build/solr-core/test-files/solr/collection1/conf/elevate.xml
[junit4:junit4] 2> 965 T3139 oashc.HttpShardHandlerFactory.getParameter Setting socketTimeout to: 0
[junit4:junit4] 2> 965 T3139 oashc.HttpShardHandlerFactory.getParameter Setting urlScheme to: http://
[junit4:junit4] 2> 965 T3139 oashc.HttpShardHandlerFactory.getParameter Setting connTimeout to: 0
[junit4:junit4] 2> 966 T3139 oashc.HttpShardHandlerFactory.getParameter Setting maxConnectionsPerHost to: 20
[junit4:junit4] 2> 966 T3139 oashc.HttpShardHandlerFactory.getParameter Setting corePoolSize to: 0
[junit4:junit4] 2> 966 T3139 oashc.HttpShardHandlerFactory.getParameter Setting maximumPoolSize to: 2147483647
[junit4:junit4] 2> 966 T3139 oashc.HttpShardHandlerFactory.getParameter Setting maxThreadIdleTime to: 5
[junit4:junit4] 2> 967 T3139 oashc.HttpShardHandlerFactory.getParameter Setting sizeOfQueue to: -1
[junit4:junit4] 2> 967 T3139 oashc.HttpShardHandlerFactory.getParameter Setting fairnessPolicy to: false
[junit4:junit4] 2> 967 T3139 oascsi.HttpClientUtil.createClient Creating new http client, config:maxConnectionsPerHost=20&maxConnections=10000&socketTimeout=0&connTimeout=0&retry=false
[junit4:junit4] 2> 970 T3139 oasc.CoreContainer.register registering core: collection1
[junit4:junit4] 2> 970 T3169 oasc.SolrCore.registerSearcher [collection1] Registered new searcher Searcher [at] 167ac5 main{StandardDirectoryReader(segments_1:1)}
[junit4:junit4] 2> 970 T3139 oass.SolrDispatchFilter.init user.dir=/mnt/ssd/jenkins/workspace/Lucene-Solr-4.x-Linux/checkout/solr/build/solr-core/test/J1
[junit4:junit4] 2> 970 T3139 oass.SolrDispatchFilter.init SolrDispatchFilter.init() done
[junit4:junit4] 2> 970 T3139 oascsi.HttpClientUtil.createClient Creating new http client, config:maxConnections=128&maxConnectionsPerHost=32&followRedirects=false
[junit4:junit4] 2> 974 T3139 oejs.Server.doStart jetty-8.1.2.v20120308
[junit4:junit4] 2> 975 T3139 oejs.AbstractConnector.doStart Started SocketConnector [at] 0:46774
[junit4:junit4] 2> 976 T3139 oasc.SolrResourceLoader.locateSolrHome JNDI not configured for solr (NoInitialContextEx)
[junit4:junit4] 2> 976 T3139 oasc.SolrResourceLoader.locateSolrHome using system property solr.solr.home: /mnt/ssd/jenkins/workspace/Lucene-Solr-4.x-Linux/checkout/solr/build/solr-core/test-files/solr
[junit4:junit4] 2> 976 T3139 oasc.SolrResourceLoader.<init> new SolrResourceLoader for deduced Solr Home: '/mnt/ssd/jenkins/workspace/Lucene-Solr-4.x-Linux/checkout/solr/build/solr-core/test-files/solr/'
[junit4:junit4] 2> 983 T3139 oass.SolrDispatchFilter.init SolrDispatchFilter.init()
[junit4:junit4] 2> 984 T3139 oasc.SolrResourceLoader.locateSolrHome JNDI not configured for solr (NoInitialContextEx)
[junit4:junit4] 2> 984 T3139 oasc.SolrResourceLoader.locateSolrHome using system property solr.solr.home: /mnt/ssd/jenkins/workspace/Lucene-Solr-4.x-Linux/checkout/solr/build/solr-core/test-files/solr
[junit4:junit4] 2> 984 T3139 oasc.CoreContainer$Initializer.initialize looking for solr.xml: /mnt/ssd/jenkins/workspace/Lucene-Solr-4.x-Linux/checkout/solr/build/solr-core/test-files/solr/solr.xml
[junit4:junit4] 2> 984 T3139 oasc.CoreContainer.<init> New CoreContainer 17809925
[junit4:junit4] 2> 984 T3139 oasc.CoreContainer.load Loading CoreContainer using Solr Home: '/mnt/ssd/jenkins/workspace/Lucene-Solr-4.x-Linux/checkout/solr/build/solr-core/test-files/solr/'
[junit4:junit4] 2> 985 T3139 oasc.SolrResourceLoader.<init> new SolrResourceLoader for directory: '/mnt/ssd/jenkins/workspace/Lucene-Solr-4.x-Linux/checkout/solr/build/solr-core/test-files/solr/'
[junit4:junit4] 2> 994 T3139 oasc.CoreContainer.load Registering Log Listener
[junit4:junit4] 2> 1004 T3139 oasc.CoreContainer.create Creating SolrCore 'collection1' using instanceDir: /mnt/ssd/jenkins/workspace/Lucene-Solr-4.x-Linux/checkout/solr/build/solr-core/test-files/solr/collection1
[junit4:junit4] 2> 1005 T3139 oasc.SolrResourceLoader.<init> new SolrResourceLoader for directory: '/mnt/ssd/jenkins/workspace/Lucene-Solr-4.x-Linux/checkout/solr/build/solr-core/test-files/solr/collection1/'
[junit4:junit4] 2> 1005 T3139 oasc.SolrResourceLoader.replaceClassLoader Adding 'file:/mnt/ssd/jenkins/workspace/Lucene-Solr-4.x-Linux/checkout/solr/build/solr-core/test-files/solr/collection1/lib/README' to classloader
[junit4:junit4] 2> 1006 T3139 oasc.SolrResourceLoader.replaceClassLoader Adding 'file:/mnt/ssd/jenkins/workspace/Lucene-Solr-4.x-Linux/checkout/solr/build/solr-core/test-files/solr/collection1/lib/classes/' to classloader
[junit4:junit4] 2> 1035 T3139 oasc.SolrConfig.<init> Using Lucene MatchVersion: LUCENE_40
[junit4:junit4] 2> 1069 T3139 oasc.SolrConfig.<init> Loaded SolrConfig: solrconfig-elevate.xml
[junit4:junit4] 2> 1069 T3139 oass.IndexSchema.readSchema Reading Solr Schema
[junit4:junit4] 2> 1072 T3139 oass.IndexSchema.readSchema Schema name=example
[junit4:junit4] 2> 1237 T3139 oass.IndexSchema.readSchema default search field in schema is text
[junit4:junit4] 2> 1246 T3139 oass.IndexSchema.readSchema unique key field: id
[junit4:junit4] 2> 1249 T3139 oasc.SolrCore.<init> [collection1] Opening new SolrCore at /mnt/ssd/jenkins/workspace/Lucene-Solr-4.x-Linux/checkout/solr/build/solr-core/test-files/solr/collection1/, dataDir=./org.apache.solr.handler.component.DistributedQueryElevationComponentTest-1343933161216/shard2/data/
[junit4:junit4] 2> 1249 T3139 oasc.JmxMonitoredMap.<init> JMX monitoring is enabled. Adding Solr mbeans to JMX Server: com.sun.jmx.mbeanserver.JmxMBeanServer [at] 1c13fc
[junit4:junit4] 2> 1250 T3139 oasc.SolrCore.getNewIndexDir WARNING New index directory detected: old=null new=./org.apache.solr.handler.component.DistributedQueryElevationComponentTest-1343933161216/shard2/data/index/
[junit4:junit4] 2> 1250 T3139 oasc.SolrCore.initIndex WARNING [collection1] Solr index directory './org.apache.solr.handler.component.DistributedQueryElevationComponentTest-1343933161216/shard2/data/index' doesn't exist. Creating new index...
[junit4:junit4] 2> 1251 T3139 oasc.SolrDeletionPolicy.onCommit SolrDeletionPolicy.onCommit: commits:num=1
[junit4:junit4] 2> commit{dir=MockDirWrapper(org.apache.lucene.store.RAMDirectory [at] 1dd6c3 lockFactory=org.apache.lucene.store.SingleInstanceLockFactory [at] 10c257),segFN=segments_1,generation=1,filenames=[segments_1]
[junit4:junit4] 2> 1251 T3139 oasc.SolrDeletionPolicy.updateCommits newest commit = 1
[junit4:junit4] 2> 1252 T3139 oasc.RequestHandlers.initHandlersFromConfig created /update: solr.UpdateRequestHandler
[junit4:junit4] 2> 1252 T3139 oasc.RequestHandlers.initHandlersFromConfig created /elevate: org.apache.solr.handler.component.SearchHandler
[junit4:junit4] 2> 1253 T3139 oasc.RequestHandlers.initHandlersFromConfig created /dataElevate: org.apache.solr.handler.component.SearchHandler
[junit4:junit4] 2> 1253 T3139 oashl.XMLLoader.init xsltCacheLifetimeSeconds=60
[junit4:junit4] 2> 1253 T3139 oasc.RequestHandlers.initHandlersFromConfig WARNING no default request handler is registered (either '/select' or 'standard')
[junit4:junit4] 2> 1255 T3139 oasc.SolrCore.initDeprecatedSupport WARNING solrconfig.xml uses deprecated <admin/gettableFiles>, Please update your config to use the ShowFileRequestHandler.
[junit4:junit4] 2> 1255 T3139 oasc.SolrCore.initDeprecatedSupport WARNING adding ShowFileRequestHandler with hidden files: [.SOLRCONFIG-NOCACHE.XML, SOLRCONFIG-SPELLCHECKCOMPONENT.XML, SOLRCONFIG-QUERYSENDER-NOQUERY.XML, SOLRCONFIG-XINCLUDE.XML, SCHEMA-SIM.XML, STOPWORDS.TXT, SOLRCONFIG-REQHANDLER.INCL, BAD-SCHEMA-DUP-DYNAMICFIELD.XML, SCHEMA-LMJELINEKMERCER.XML, SCHEMA-MINIMAL.XML, SOLRCONFIG-SIMPLELOCK.XML, CURRENCY.XML, SOLRCONFIG-LAZYWRITER.XML, SCHEMA-FOLDING.XML, SCHEMA-REQUIRED-FIELDS.XML, SOLRCONFIG-CACHING.XML, THROW.ERROR.ON.ADD.UPDATEPROCESSOR.JS, SOLRCONFIG-ELEVATE.XML, SCHEMA12.XML, SOLRCONFIG-SCRIPT-UPDATEPROCESSOR.XML, MISSING.FUNCTIONS.UPDATEPROCESSOR.JS, BAD-SCHEMA-UNIQUEKEY-IS-COPYFIELD-DEST.XML, STOPWITHBOM.TXT, SOLRCONFIG_PERF.XML, SCHEMA-CHARFILTERS.XML, SOLRCONFIG-BASIC.XML, STOPTYPES-2.TXT, SCHEMA-IB.XML, SCHEMA-REPLICATION2.XML, FRENCHARTICLES.TXT, SCHEMA-SPELLCHECKER.XML, SOLRCONFIG-TLOG.XML, STOP-2.TXT, PROTWORDS.TXT, SCHEMA-NUMERIC.XML, SOLRCONFIG-ALTDIRECTORY.XML, SCHEMA-PHRASESUGGEST.XML, SCHEMA-REPLICATION1.XML, SCHEMA-BINARYFIELD.XML, BAD-SCHEMA-OMIT-TF-BUT-NOT-POS.XML, SOLRCONFIG-SLAVE1.XML, SOLRCONFIG-MASTER3.XML, XSLT, SOLRCONFIG-QUERYSENDER.XML, SOLRCONFIG-MASTER2.XML, SOLRCONFIG-FUNCTIONQUERY.XML, BAD-SCHEMA-DUP-FIELDTYPE.XML, DA_COMPOUNDDICTIONARY.TXT, STOPWORDSWRONGENCODING.TXT, SYNONYMS.TXT, SOLRCONFIG-PROPINJECT.XML, OPEN-EXCHANGE-RATES.JSON, BAD-SCHEMA-NOT-INDEXED-BUT-NORMS.XML, MISSLEADING.EXTENSION.UPDATEPROCESSOR.JS.TXT, SOLRCONFIG-SLAVE.XML, SOLRCONFIG-REPEATER.XML, BAD-SCHEMA-NOT-INDEXED-BUT-POS.XML, SOLRCONFIG-MASTER1.XML, SCHEMA11.XML, BAD-MP-SOLRCONFIG.XML, HUNSPELL-TEST.AFF, TRIVIAL.UPDATEPROCESSOR1.JS, SCHEMA-TFIDF.XML, COMPOUNDDICTIONARY.TXT, SOLRCONFIG-BASIC-LUCENEVERSION31.XML, SOLRCONFIG-NATIVELOCK.XML, BAD_SOLRCONFIG.XML, SCHEMA-NOT-REQUIRED-UNIQUE-KEY.XML, SCHEMA-LMDIRICHLET.XML, SCHEMA-DFR.XML, DA_UTF8.XML, BAD-SOLRCONFIG-BOGUS-SCRIPTENGINE-NAME.XML, SOLRCONFIG-DELPOLICY1.XML, BAD-SCHEMA-NOT-INDEXED-BUT-TF.XML, STOPTYPES-1.TXT, SCHEMA.XML, SCHEMA-COPYFIELD-TEST.XML, HYPHENATION.DTD, SCHEMA15.XML, OLD_SYNONYMS.TXT, TRIVIAL.UPDATEPROCESSOR0.JS, SCHEMA-LUCENEMATCHVERSION.XML, ADDFIELDS.UPDATEPROCESSOR.JS, SCHEMA_CODEC.XML, SCHEMA-BM25.XML, SOLRCONFIG-TERMINDEX.XML, SOLRCONFIG_CODEC.XML, SOLRCONFIG-PROPINJECT-INDEXDEFAULT.XML, STOP-SNOWBALL.TXT, SOLRCONFIG-DELPOLICY2.XML, SOLRCONFIG-MASTER1-KEEPONEBACKUP.XML, SOLRCONFIG-MASTER.XML, SCHEMA-COLLATEFILTER.XML, BAD-SCHEMA-CODEC-GLOBAL-VS-FT-MISMATCH.XML, STOP-1.TXT, SOLRCONFIG-PHRASESUGGEST.XML, BAD-SCHEMA-SIM-GLOBAL-VS-FT-MISMATCH.XML, BAD-SCHEMA-EXTERNAL-FILEFIELD.XML, BAD-SCHEMA-ANALYZER-CLASS-AND-NESTED.XML, BAD-SOLRCONFIG-MISSING-SCRIPTFILE.XML, ELEVATE.XML, SOLRCONFIG-MERGEPOLICY.XML, BAD-SCHEMA-NONTEXT-ANALYZER.XML, SOLRCONFIG-TRANSFORMERS.XML, BAD-SCHEMA-UNIQUEKEY-MULTIVALUED.XML, SCHEMA-TRIE.XML, PHRASESUGGEST.TXT, HUNSPELL-TEST.DIC, SOLRCONFIG-UPDATE-PROCESSOR-CHAINS.XML, KEEP-1.TXT, SCHEMA-COLLATE.XML, SCHEMA-REVERSED.XML, SOLRCONFIG-ENABLEPLUGIN.XML, BAD-SCHEMA-UNIQUEKEY-USES-DEFAULT.XML, SCHEMA-STOP-KEEP.XML, MAPPING-ISOLATIN1ACCENT.TXT, SOLRCONFIG-SOLR-749.XML, SOLRCONFIG-SOLCOREPROPERTIES.XML, SCHEMASURROUND.XML, WDFTYPES.TXT, SOLRCONFIG-HIGHLIGHT.XML, STEMDICT.TXT, BAD-SCHEMA-DUP-FIELD.XML, CONDITIONAL.UPDATEPROCESSOR.JS, BAD-SOLRCONFIG-INVALID-SCRIPTFILE.XML, SOLRCONFIG-SPELLCHECKER.XML, KEEP-2.TXT]
[junit4:junit4] 2> 1258 T3139 oass.SolrIndexSearcher.<init> Opening Searcher [at] 1ee02a main
[junit4:junit4] 2> 1258 T3139 oass.SolrIndexSearcher.getIndexDir WARNING WARNING: Directory impl does not support setting indexDir: org.apache.lucene.store.MockDirectoryWrapper
[junit4:junit4] 2> 1258 T3139 oasu.CommitTracker.<init> Hard AutoCommit: disabled
[junit4:junit4] 2> 1258 T3139 oasu.CommitTracker.<init> Soft AutoCommit: disabled
[junit4:junit4] 2> 1259 T3139 oashc.QueryElevationComponent.inform Loading QueryElevation from: /mnt/ssd/jenkins/workspace/Lucene-Solr-4.x-Linux/checkout/solr/build/solr-core/test-files/solr/collection1/conf/elevate.xml
[junit4:junit4] 2> 1265 T3139 oashc.QueryElevationComponent.inform Loading QueryElevation from: /mnt/ssd/jenkins/workspace/Lucene-Solr-4.x-Linux/checkout/solr/build/solr-core/test-files/solr/collection1/conf/elevate.xml
[junit4:junit4] 2> 1272 T3139 oashc.HttpShardHandlerFactory.getParameter Setting socketTimeout to: 0
[junit4:junit4] 2> 1273 T3139 oashc.HttpShardHandlerFactory.getParameter Setting urlScheme to: http://
[junit4:junit4] 2> 1273 T3139 oashc.HttpShardHandlerFactory.getParameter Setting connTimeout to: 0
[junit4:junit4] 2> 1273 T3139 oashc.HttpShardHandlerFactory.getParameter Setting maxConnectionsPerHost to: 20
[junit4:junit4] 2> 1273 T3139 oashc.HttpShardHandlerFactory.getParameter Setting corePoolSize to: 0
[junit4:junit4] 2> 1274 T3139 oashc.HttpShardHandlerFactory.getParameter Setting maximumPoolSize to: 2147483647
[junit4:junit4] 2> 1274 T3139 oashc.HttpShardHandlerFactory.getParameter Setting maxThreadIdleTime to: 5
[junit4:junit4] 2> 1274 T3139 oashc.HttpShardHandlerFactory.getParameter Setting sizeOfQueue to: -1
[junit4:junit4] 2> 1274 T3139 oashc.HttpShardHandlerFactory.getParameter Setting fairnessPolicy to: false
[junit4:junit4] 2> 1275 T3139 oascsi.HttpClientUtil.createClient Creating new http client, config:maxConnectionsPerHost=20&maxConnections=10000&socketTimeout=0&connTimeout=0&retry=false
[junit4:junit4] 2> 1277 T3139 oasc.CoreContainer.register registering core: collection1
[junit4:junit4] 2> 1277 T3179 oasc.SolrCore.registerSearcher [collection1] Registered new searcher Searcher [at] 1ee02a main{StandardDirectoryReader(segments_1:1)}
[junit4:junit4] 2> 1278 T3139 oass.SolrDispatchFilter.init user.dir=/mnt/ssd/jenkins/workspace/Lucene-Solr-4.x-Linux/checkout/solr/build/solr-core/test/J1
[junit4:junit4] 2> 1278 T3139 oass.SolrDispatchFilter.init SolrDispatchFilter.init() done
[junit4:junit4] 2> 1278 T3139 oascsi.HttpClientUtil.createClient Creating new http client, config:maxConnections=128&maxConnectionsPerHost=32&followRedirects=false
[junit4:junit4] 2> ASYNC NEW_CORE C154 name=collection1 org.apache.solr.core.SolrCore [at] 1dba2b
[junit4:junit4] 2> 1283 T3142 C154 oasu.DirectUpdateHandler2.deleteAll [collection1] REMOVING ALL DOCUMENTS FROM INDEX
[junit4:junit4] 2> 1285 T3142 C154 oasc.SolrDeletionPolicy.onInit SolrDeletionPolicy.onInit: commits:num=1
[junit4:junit4] 2> commit{dir=MockDirWrapper(NRTCachingDirectory(org.apache.lucene.store.RAMDirectory [at] 96b78 lockFactory=org.apache.lucene.store.SingleInstanceLockFactory [at] 2fd6d; maxCacheMB=0.1982421875 maxMergeSizeMB=0.390625)),segFN=segments_1,generation=1,filenames=[segments_1]
[junit4:junit4] 2> 1285 T3142 C154 oasc.SolrDeletionPolicy.updateCommits newest commit = 1
[junit4:junit4] 2> 1285 T3142 C154 UPDATE [collection1] webapp=/solr path=/update params={wt=javabin&version=2} {deleteByQuery=*:*} 0 2
[junit4:junit4] 2> ASYNC NEW_CORE C155 name=collection1 org.apache.solr.core.SolrCore [at] 55132
[junit4:junit4] 2> 1289 T3152 C155 oasu.DirectUpdateHandler2.deleteAll [collection1] REMOVING ALL DOCUMENTS FROM INDEX
[junit4:junit4] 2> 1290 T3152 C155 oasc.SolrDeletionPolicy.onInit SolrDeletionPolicy.onInit: commits:num=1
[junit4:junit4] 2> commit{dir=MockDirWrapper(NRTCachingDirectory(org.apache.lucene.store.RAMDirectory [at] 15c260 lockFactory=org.apache.lucene.store.SingleInstanceLockFactory [at] 78c43; maxCacheMB=0.2705078125 maxMergeSizeMB=0.8173828125)),segFN=segments_1,generation=1,filenames=[segments_1]
[junit4:junit4] 2> 1291 T3152 C155 oasc.SolrDeletionPolicy.updateCommits newest commit = 1
[junit4:junit4] 2> 1291 T3152 C155 UPDATE [collection1] webapp=/solr path=/update params={wt=javabin&version=2} {deleteByQuery=*:*} 0 2
[junit4:junit4] 2> ASYNC NEW_CORE C156 name=collection1 org.apache.solr.core.SolrCore [at] 9b71
[junit4:junit4] 2> 1294 T3162 C156 oasu.DirectUpdateHandler2.deleteAll [collection1] REMOVING ALL DOCUMENTS FROM INDEX
[junit4:junit4] 2> 1296 T3162 C156 oasc.SolrDeletionPolicy.onInit SolrDeletionPolicy.onInit: commits:num=1
[junit4:junit4] 2> commit{dir=MockDirWrapper(org.apache.lucene.store.RAMDirectory [at] 1d3711 lockFactory=org.apache.lucene.store.SingleInstanceLockFactory [at] ada87),segFN=segments_1,generation=1,filenames=[segments_1]
[junit4:junit4] 2> 1296 T3162 C156 oasc.SolrDeletionPolicy.updateCommits newest commit = 1
[junit4:junit4] 2> 1296 T3162 C156 UPDATE [collection1] webapp=/solr path=/update params={wt=javabin&version=2} {deleteByQuery=*:*} 0 2
[junit4:junit4] 2> ASYNC NEW_CORE C157 name=collection1 org.apache.solr.core.SolrCore [at] bc4af
[junit4:junit4] 2> 1301 T3172 C157 oasu.DirectUpdateHandler2.deleteAll [collection1] REMOVING ALL DOCUMENTS FROM INDEX
[junit4:junit4] 2> 1302 T3172 C157 oasc.SolrDeletionPolicy.onInit SolrDeletionPolicy.onInit: commits:num=1
[junit4:junit4] 2> commit{dir=MockDirWrapper(org.apache.lucene.store.RAMDirectory [at] 1dd6c3 lockFactory=org.apache.lucene.store.SingleInstanceLockFactory [at] 10c257),segFN=segments_1,generation=1,filenames=[segments_1]
[junit4:junit4] 2> 1303 T3172 C157 oasc.SolrDeletionPolicy.updateCommits newest commit = 1
[junit4:junit4] 2> 1303 T3172 C157 UPDATE [collection1] webapp=/solr path=/update params={wt=javabin&version=2} {deleteByQuery=*:*} 0 2
[junit4:junit4] 2> 1306 T3142 C154 UPDATE [collection1] webapp=/solr path=/update params={wt=javabin&version=2} {add=[1]} 0 1
[junit4:junit4] 2> 1308 T3152 C155 UPDATE [collection1] webapp=/solr path=/update params={wt=javabin&version=2} {add=[1]} 0 1
[junit4:junit4] 2> 1309 T3142 C154 UPDATE [collection1] webapp=/solr path=/update params={wt=javabin&version=2} {add=[2]} 0 0
[junit4:junit4] 2> 1312 T3162 C156 UPDATE [collection1] webapp=/solr path=/update params={wt=javabin&version=2} {add=[2]} 0 1
[junit4:junit4] 2> 1313 T3142 C154 UPDATE [collection1] webapp=/solr path=/update params={wt=javabin&version=2} {add=[3]} 0 0
[junit4:junit4] 2> 1316 T3172 C157 UPDATE [collection1] webapp=/solr path=/update params={wt=javabin&version=2} {add=[3]} 0 1
[junit4:junit4] 2> 1317 T3142 C154 UPDATE [collection1] webapp=/solr path=/update params={wt=javabin&version=2} {add=[4]} 0 0
[junit4:junit4] 2> 1319 T3152 C155 UPDATE [collection1] webapp=/solr path=/update params={wt=javabin&version=2} {add=[4]} 0 0
[junit4:junit4] 2> 1321 T3142 C154 UPDATE [collection1] webapp=/solr path=/update params={wt=javabin&version=2} {add=[5]} 0 0
[junit4:junit4] 2> 1323 T3162 C156 UPDATE [collection1] webapp=/solr path=/update params={wt=javabin&version=2} {add=[5]} 0 0
[junit4:junit4] 2> 1324 T3142 C154 UPDATE [collection1] webapp=/solr path=/update params={wt=javabin&version=2} {add=[6]} 0 0
[junit4:junit4] 2> 1326 T3172 C157 UPDATE [collection1] webapp=/solr path=/update params={wt=javabin&version=2} {add=[6]} 0 0
[junit4:junit4] 2> 1328 T3142 C154 UPDATE [collection1] webapp=/solr path=/update params={wt=javabin&version=2} {add=[7]} 0 0
[junit4:junit4] 2> 1330 T3172 C157 UPDATE [collection1] webapp=/solr path=/update params={wt=javabin&version=2} {add=[7]} 0 0
[junit4:junit4] 2> 1332 T3142 C154 oasu.DirectUpdateHandler2.commit start commit{flags=0,_version_=0,optimize=false,openSearcher=true,waitSearcher=true,expungeDeletes=false,softCommit=false}
[junit4:junit4] 2> 1332 T3142 C154 oasc.SolrDeletionPolicy.onCommit SolrDeletionPolicy.onCommit: commits:num=2
[junit4:junit4] 2> commit{dir=MockDirWrapper(NRTCachingDirectory(org.apache.lucene.store.RAMDirectory [at] 96b78 lockFactory=org.apache.lucene.store.SingleInstanceLockFactory [at] 2fd6d; maxCacheMB=0.1982421875 maxMergeSizeMB=0.390625)),segFN=segments_1,generation=1,filenames=[segments_1]
[junit4:junit4] 2> commit{dir=MockDirWrapper(NRTCachingDirectory(org.apache.lucene.store.RAMDirectory [at] 96b78 lockFactory=org.apache.lucene.store.SingleInstanceLockFactory [at] 2fd6d; maxCacheMB=0.1982421875 maxMergeSizeMB=0.390625)),segFN=segments_2,generation=2,filenames=[_0.fdx, _0.prx, _0.si, _0.tii, _0.frq, _0.fdt, _0.fnm, segments_2, _0.tis, _0.nrm]
[junit4:junit4] 2> 1333 T3142 C154 oasc.SolrDeletionPolicy.updateCommits newest commit = 2
[junit4:junit4] 2> 1333 T3142 C154 oass.SolrIndexSearcher.<init> Opening Searcher [at] 15aa29 main
[junit4:junit4] 2> 1334 T3142 C154 oass.SolrIndexSearcher.getIndexDir WARNING WARNING: Directory impl does not support setting indexDir: org.apache.lucene.store.MockDirectoryWrapper
[junit4:junit4] 2> 1334 T3142 C154 oasu.DirectUpdateHandler2.commit end_commit_flush
[junit4:junit4] 2> 1334 T3149 oasc.SolrCore.registerSearcher [collection1] Registered new searcher Searcher [at] 15aa29 main{StandardDirectoryReader(segments_2:4 _0(4.0.0.1):C7)}
[junit4:junit4] 2> 1335 T3142 C154 UPDATE [collection1] webapp=/solr path=/update params={commit=true&softCommit=false&wt=javabin&waitSearcher=true&version=2} {commit=} 0 3
[junit4:junit4] 2> 1337 T3152 C155 oasu.DirectUpdateHandler2.commit start commit{flags=0,_version_=0,optimize=false,openSearcher=true,waitSearcher=true,expungeDeletes=false,softCommit=false}
[junit4:junit4] 2> 1337 T3152 C155 oasc.SolrDeletionPolicy.onCommit SolrDeletionPolicy.onCommit: commits:num=2
[junit4:junit4] 2> commit{dir=MockDirWrapper(NRTCachingDirectory(org.apache.lucene.store.RAMDirectory [at] 15c260 lockFactory=org.apache.lucene.store.SingleInstanceLockFactory [at] 78c43; maxCacheMB=0.2705078125 maxMergeSizeMB=0.8173828125)),segFN=segments_1,generation=1,filenames=[segments_1]
[junit4:junit4] 2> commit{dir=MockDirWrapper(NRTCachingDirectory(org.apache.lucene.store.RAMDirectory [at] 15c260 lockFactory=org.apache.lucene.store.SingleInstanceLockFactory [at] 78c43; maxCacheMB=0.2705078125 maxMergeSizeMB=0.8173828125)),segFN=segments_2,generation=2,filenames=[_0.fdx, _0.prx, _0.si, _0.tii, _0.frq, _0.fdt, _0.fnm, segments_2, _0.tis, _0.nrm]
[junit4:junit4] 2> 1338 T3152 C155 oasc.SolrDeletionPolicy.updateCommits newest commit = 2
[junit4:junit4] 2> 1338 T3152 C155 oass.SolrIndexSearcher.<init> Opening Searcher [at] 1ead6c main
[junit4:junit4] 2> 1338 T3152 C155 oass.SolrIndexSearcher.getIndexDir WARNING WARNING: Directory impl does not support setting indexDir: org.apache.lucene.store.MockDirectoryWrapper
[junit4:junit4] 2> 1339 T3152 C155 oasu.DirectUpdateHandler2.commit end_commit_flush
[junit4:junit4] 2> 1339 T3159 oasc.SolrCore.registerSearcher [collection1] Registered new searcher Searcher [at] 1ead6c main{StandardDirectoryReader(segments_2:4 _0(4.0.0.1):C2)}
[junit4:junit4] 2> 1339 T3152 C155 UPDATE [collection1] webapp=/solr path=/update params={commit=true&softCommit=false&wt=javabin&waitSearcher=true&version=2} {commit=} 0 3
[junit4:junit4] 2> 1341 T3162 C156 oasu.DirectUpdateHandler2.commit start commit{flags=0,_version_=0,optimize=false,openSearcher=true,waitSearcher=true,expungeDeletes=false,softCommit=false}
[junit4:junit4] 2> 1342 T3162 C156 oasc.SolrDeletionPolicy.onCommit SolrDeletionPolicy.onCommit: commits:num=2
[junit4:junit4] 2> commit{dir=MockDirWrapper(org.apache.lucene.store.RAMDirectory [at] 1d3711 lockFactory=org.apache.lucene.store.SingleInstanceLockFactory [at] ada87),segFN=segments_1,generation=1,filenames=[segments_1]
[junit4:junit4] 2> commit{dir=MockDirWrapper(org.apache.lucene.store.RAMDirectory [at] 1d3711 lockFactory=org.apache.lucene.store.SingleInstanceLockFactory [at] ada87),segFN=segments_2,generation=2,filenames=[_0.fdx, _0.prx, _0.si, _0.tii, _0.frq, _0.fdt, _0.fnm, segments_2, _0.tis, _0.nrm]
[junit4:junit4] 2> 1342 T3162 C156 oasc.SolrDeletionPolicy.updateCommits newest commit = 2
[junit4:junit4] 2> 1343 T3162 C156 oass.SolrIndexSearcher.<init> Opening Searcher [at] 18164f main
[junit4:junit4] 2> 1343 T3162 C156 oass.SolrIndexSearcher.getIndexDir WARNING WARNING: Directory impl does not support setting indexDir: org.apache.lucene.store.MockDirectoryWrapper
[junit4:junit4] 2> 1343 T3162 C156 oasu.DirectUpdateHandler2.commit end_commit_flush
[junit4:junit4] 2> 1344 T3169 oasc.SolrCore.registerSearcher [collection1] Registered new searcher Searcher [at] 18164f main{StandardDirectoryReader(segments_2:4 _0(4.0.0.1):C2)}
[junit4:junit4] 2> 1344 T3162 C156 UPDATE [collection1] webapp=/solr path=/update params={commit=true&softCommit=false&wt=javabin&waitSearcher=true&version=2} {commit=} 0 3
[junit4:junit4] 2> 1346 T3172 C157 oasu.DirectUpdateHandler2.commit start commit{flags=0,_version_=0,optimize=false,openSearcher=true,waitSearcher=true,expungeDeletes=false,softCommit=false}
[junit4:junit4] 2> 1347 T3172 C157 oasc.SolrDeletionPolicy.onCommit SolrDeletionPolicy.onCommit: commits:num=2
[junit4:junit4] 2> commit{dir=MockDirWrapper(org.apache.lucene.store.RAMDirectory [at] 1dd6c3 lockFactory=org.apache.lucene.store.SingleInstanceLockFactory [at] 10c257),segFN=segments_1,generation=1,filenames=[segments_1]
[junit4:junit4] 2> commit{dir=MockDirWrapper(org.apache.lucene.store.RAMDirectory [at] 1dd6c3 lockFactory=org.apache.lucene.store.SingleInstanceLockFactory [at] 10c257),segFN=segments_2,generation=2,filenames=[_0.fdx, _0.prx, _0.si, _0.tii, _0.frq, _0.fdt, _0.fnm, segments_2, _0.tis, _0.nrm]
[junit4:junit4] 2> 1347 T3172 C157 oasc.SolrDeletionPolicy.updateCommits newest commit = 2
[junit4:junit4] 2> 1348 T3172 C157 oass.SolrIndexSearcher.<init> Opening Searcher [at] d8240 main
[junit4:junit4] 2> 1348 T3172 C157 oass.SolrIndexSearcher.getIndexDir WARNING WARNING: Directory impl does not support setting indexDir: org.apache.lucene.store.MockDirectoryWrapper
[junit4:junit4] 2> 1349 T3172 C157 oasu.DirectUpdateHandler2.commit end_commit_flush
[junit4:junit4] 2> 1349 T3179 oasc.SolrCore.registerSearcher [collection1] Registered new searcher Searcher [at] d8240 main{StandardDirectoryReader(segments_2:4 _0(4.0.0.1):C3)}
[junit4:junit4] 2> 1350 T3172 C157 UPDATE [collection1] webapp=/solr path=/update params={commit=true&softCommit=false&wt=javabin&waitSearcher=true&version=2} {commit=} 0 4
[junit4:junit4] 2> 1352 T3142 C154 REQ [collection1] webapp=/solr path=/elevate params={shards.qt=/elevate&rows=500&wt=javabin&version=2&distrib=false&sort=id+desc&q=*:*&qt=/elevate&fl=id,+score,+[elevated]} hits=7 status=0 QTime=0
[junit4:junit4] 2> 1357 T3163 C156 REQ [collection1] webapp=/solr path=/elevate params={fsv=true&start=0&rows=500&version=2&NOW=1343933162568&isShard=true&distrib=false&sort=id+desc&qt=/elevate&shard.url=[::1]:33332/solr|localhost:52572/solr&shards.qt=/elevate&wt=javabin&q=*:*&fl=id,score} hits=2 status=0 QTime=1
[junit4:junit4] 2> 1357 T3153 C155 REQ [collection1] webapp=/solr path=/elevate params={fsv=true&start=0&rows=500&version=2&NOW=1343933162568&isShard=true&distrib=false&sort=id+desc&qt=/elevate&shard.url=[::1]:33332/solr|localhost:58598/solr&shards.qt=/elevate&wt=javabin&q=*:*&fl=id,score} hits=2 status=0 QTime=1
[junit4:junit4] 2> 1357 T3173 C157 REQ [collection1] webapp=/solr path=/elevate params={fsv=true&start=0&rows=500&version=2&NOW=1343933162568&isShard=true&distrib=false&sort=id+desc&qt=/elevate&shard.url=localhost:46774/solr&shards.qt=/elevate&wt=javabin&q=*:*&fl=id,score} hits=3 status=0 QTime=1
[junit4:junit4] 2> 1359 T3163 C156 REQ [collection1] webapp=/solr path=/elevate params={rows=500&version=2&distrib=false&isShard=true&NOW=1343933162568&ids=5.0,2.0&qt=/elevate&shard.url=[::1]:33332/solr|localhost:52572/solr&shards.qt=/elevate&wt=javabin&q=*:*&fl=id,+score,+[elevated]} status=0 QTime=0
[junit4:junit4] 2> 1359 T3153 C155 REQ [collection1] webapp=/solr path=/elevate params={rows=500&version=2&distrib=false&isShard=true&NOW=1343933162568&ids=1.0,4.0&qt=/elevate&shard.url=[::1]:33332/solr|localhost:58598/solr&shards.qt=/elevate&wt=javabin&q=*:*&fl=id,+score,+[elevated]} status=0 QTime=0
[junit4:junit4] 2> 1359 T3173 C157 REQ [collection1] webapp=/solr path=/elevate params={rows=500&version=2&distrib=false&isShard=true&NOW=1343933162568&ids=7.0,6.0,3.0&qt=/elevate&shard.url=localhost:46774/solr&shards.qt=/elevate&wt=javabin&q=*:*&fl=id,+score,+[elevated]} status=0 QTime=0
[junit4:junit4] 2> 1360 T3162 C156 REQ [collection1] webapp=/solr path=/elevate params={shards.qt=/elevate&rows=500&wt=javabin&version=2&sort=id+desc&q=*:*&qt=/elevate&fl=id,+score,+[elevated]&shards=[::1]:33332/solr|localhost:58598/solr,[::1]:33332/solr|localhost:52572/solr,localhost:46774/solr} status=0 QTime=6
[junit4:junit4] 2> 1361 T3139 oas.BaseDistributedSearchTestCase.compareResponses SEVERE Mismatched responses:
[junit4:junit4] 2> {responseHeader={status=0,QTime=6,params={shards.qt=/elevate,rows=500,wt=javabin,version=2,sort=id desc,q=*:*,qt=/elevate,fl=id, score, [elevated],shards=[::1]:33332/solr|localhost:58598/solr,[::1]:33332/solr|localhost:52572/solr,localhost:46774/solr}},response={numFound=7,start=0,maxScore=1.0,docs=[SolrDocument{id=7.0, [elevated]=false, score=1.0}, SolrDocument{id=6.0, [elevated]=false, score=1.0}, SolrDocument{id=5.0, [elevated]=false, score=1.0}, SolrDocument{id=4.0, [elevated]=false, score=1.0}, SolrDocument{id=3.0, [elevated]=false, score=1.0}, SolrDocument{id=2.0, [elevated]=false, score=1.0}, SolrDocument{id=1.0, [elevated]=false, score=1.0}]}}
[junit4:junit4] 2> {responseHeader={status=0,QTime=0,params={shards.qt=/elevate,rows=500,wt=javabin,version=2,distrib=false,sort=id desc,q=*:*,qt=/elevate,fl=id, score, [elevated]}},response={numFound=7,start=0,maxScore=1.0,docs=[SolrDocument{id=7.0, score=1.0, [elevated]=false}, SolrDocument{id=6.0, score=1.0, [elevated]=false}, SolrDocument{id=5.0, score=1.0, [elevated]=false}, SolrDocument{id=4.0, score=1.0, [elevated]=false}, SolrDocument{id=3.0, score=1.0, [elevated]=false}, SolrDocument{id=2.0, score=1.0, [elevated]=false}, SolrDocument{id=1.0, score=1.0, [elevated]=false}]}}
[junit4:junit4] 2> 1362 T3139 oasc.CoreContainer.shutdown Shutting down CoreContainer instance=11238639
[junit4:junit4] 2> 1363 T3139 oasc.SolrCore.close [collection1] CLOSING SolrCore org.apache.solr.core.SolrCore [at] 1dba2b
[junit4:junit4] 2> 1364 T3139 oasc.SolrCore.closeSearcher [collection1] Closing main searcher on request.
[junit4:junit4] 2> 1364 T3139 oasu.DirectUpdateHandler2.close closing DirectUpdateHandler2{commits=1,autocommits=0,soft autocommits=0,optimizes=0,rollbacks=0,expungeDeletes=0,docsPending=0,adds=0,deletesById=0,deletesByQuery=0,errors=0,cumulative_adds=7,cumulative_deletesById=0,cumulative_deletesByQuery=1,cumulative_errors=0}
[junit4:junit4] 2> 1369 T3139 oejsh.ContextHandler.doStop stopped o.e.j.s.ServletContextHandler{/solr,null}
[junit4:junit4] 2> 1420 T3139 oasc.CoreContainer.shutdown Shutting down CoreContainer instance=30038032
[junit4:junit4] 2> 1421 T3139 oasc.SolrCore.close [collection1] CLOSING SolrCore org.apache.solr.core.SolrCore [at] 55132
[junit4:junit4] 2> 1421 T3139 oasc.SolrCore.closeSearcher [collection1] Closing main searcher on request.
[junit4:junit4] 2> 1422 T3139 oasu.DirectUpdateHandler2.close closing DirectUpdateHandler2{commits=1,autocommits=0,soft autocommits=0,optimizes=0,rollbacks=0,expungeDeletes=0,docsPending=0,adds=0,deletesById=0,deletesByQuery=0,errors=0,cumulative_adds=2,cumulative_deletesById=0,cumulative_deletesByQuery=1,cumulative_errors=0}
[junit4:junit4] 2> 1426 T3139 oejsh.ContextHandler.doStop stopped o.e.j.s.ServletContextHandler{/solr,null}
[junit4:junit4] 2> 1479 T3139 oasc.CoreContainer.shutdown Shutting down CoreContainer instance=12785723
[junit4:junit4] 2> 1479 T3139 oasc.SolrCore.close [collection1] CLOSING SolrCore org.apache.solr.core.SolrCore [at] 9b71
[junit4:junit4] 2> 1480 T3139 oasc.SolrCore.closeSearcher [collection1] Closing main searcher on request.
[junit4:junit4] 2> 1480 T3139 oasu.DirectUpdateHandler2.close closing DirectUpdateHandler2{commits=1,autocommits=0,soft autocommits=0,optimizes=0,rollbacks=0,expungeDeletes=0,docsPending=0,adds=0,deletesById=0,deletesByQuery=0,errors=0,cumulative_adds=2,cumulative_deletesById=0,cumulative_deletesByQuery=1,cumulative_errors=0}
[junit4:junit4] 2> 1485 T3139 oejsh.ContextHandler.doStop stopped o.e.j.s.ServletContextHandler{/solr,null}
[junit4:junit4] 2> 1536 T3139 oasc.CoreContainer.shutdown Shutting down CoreContainer instance=17809925
[junit4:junit4] 2> 1537 T3139 oasc.SolrCore.close [collection1] CLOSING SolrCore org.apache.solr.core.SolrCore [at] bc4af
[junit4:junit4] 2> 1538 T3139 oasc.SolrCore.closeSearcher [collection1] Closing main searcher on request.
[junit4:junit4] 2> 1538 T3139 oasu.DirectUpdateHandler2.close closing DirectUpdateHandler2{commits=1,autocommits=0,soft autocommits=0,optimizes=0,rollbacks=0,expungeDeletes=0,docsPending=0,adds=0,deletesById=0,deletesByQuery=0,errors=0,cumulative_adds=3,cumulative_deletesById=0,cumulative_deletesByQuery=1,cumulative_errors=0}
[junit4:junit4] 2> 1541 T3139 oejsh.ContextHandler.doStop stopped o.e.j.s.ServletContextHandler{/solr,null}
[junit4:junit4] 2> 1593 T3139 oas.SolrTestCaseJ4.tearDown ###Ending testDistribSearch
[junit4:junit4] 2> NOTE: reproduce with: ant test -Dtestcase=DistributedQueryElevationComponentTest -Dtests.method=testDistribSearch -Dtests.seed=124DC290FC523F4B -Dtests.multiplier=3 -Dtests.slow=true -Dtests.locale=mt -Dtests.timezone=Asia/Istanbul -Dtests.file.encoding=US-ASCII
[junit4:junit4] 2>
[junit4:junit4] > (@AfterClass output)
[junit4:junit4] 2> 1623 T3139 oas.SolrTestCaseJ4.deleteCore ###deleteCore
[junit4:junit4] 2> NOTE: test params are: codec=Lucene3x, sim=RandomSimilarityProvider(queryNorm=false,coord=false): {}, locale=mt, timezone=Asia/Istanbul
[junit4:junit4] 2> NOTE: Linux 3.2.0-27-generic i386/Oracle Corporation 1.8.0-ea (32-bit)/cpus=8,threads=1,free=27478656,total=167063552
[junit4:junit4] 2> NOTE: All tests run in this JVM: [.TestBinaryField, TestReplicationHandler, PrimitiveFieldTypeTest, ZkControllerTest, TestPluginEnable, StatsComponentTest, TestFiltering, SpellCheckCollatorTest, URLClassifyProcessorTest, TestOmitPositions, TestSuggestSpellingConverter, TestGroupingSearch, SyncSliceTest, TestCSVLoader, EchoParamsTest, TestRealTimeGet, CoreContainerCoreInitFailuresTest, CloudStateUpdateTest, TestFoldingMultitermQuery, TestQueryUtils, DisMaxRequestHandlerTest, TestStressLucene, TestFaceting, SpellingQueryConverterTest, TestFunctionQuery, JsonLoaderTest, OpenExchangeRatesOrgProviderTest, TestQueryTypes, PolyFieldTest, TestPropInject, TestMergePolicyConfig, OutputWriterTest, TestRemoteStreaming, TestQuerySenderListener, SpellCheckComponentTest, TestSolrCoreProperties, TestReload, BasicFunctionalityTest, TestSolrDeletionPolicy1, PrimUtilsTest, SuggesterTest, TestUpdate, TestCodecSupport, QueryParsingTest, FullSolrCloudTest, DebugComponentTest, SolrIndexConfigTest, SuggesterWFSTTest, TestStressReorder, IndexReaderFactoryTest, CircularListTest, TestCharFilters, TestWriterPerf, OverseerTest, LeaderElectionIntegrationTest, LeaderElectionTest, AutoCommitTest, WordBreakSolrSpellCheckerTest, TestHashPartitioner, TestRecovery, SolrCoreTest, IndexBasedSpellCheckerTest, DirectUpdateHandlerTest, SimpleFacetsTest, LukeRequestHandlerTest, DirectSolrSpellCheckerTest, ConvertedLegacyTest, PeerSyncTest, QueryElevationComponentTest, SignatureUpdateProcessorFactoryTest, TestBinaryResponseWriter, SampleTest, HighlighterTest, TestTrie, CacheHeaderTest, QueryEqualityTest, TestCSVResponseWriter, DocumentBuilderTest, DistributedQueryElevationComponentTest]
[junit4:junit4] 2>
[junit4:junit4] Completed on J1 in 1.63s, 1 test, 1 failure <<< FAILURES!

[...truncated 246 lines...]
BUILD FAILED
/mnt/ssd/jenkins/workspace/Lucene-Solr-4.x-Linux/checkout/build.xml:29: The following error occurred while executing this line:
/mnt/ssd/jenkins/workspace/Lucene-Solr-4.x-Linux/checkout/solr/build.xml:144: The following error occurred while executing this line:
/mnt/ssd/jenkins/workspace/Lucene-Solr-4.x-Linux/checkout/lucene/module-build.xml:62: The following error occurred while executing this line:
/mnt/ssd/jenkins/workspace/Lucene-Solr-4.x-Linux/checkout/lucene/common-build.xml:1095: The following error occurred while executing this line:
/mnt/ssd/jenkins/workspace/Lucene-Solr-4.x-Linux/checkout/lucene/common-build.xml:790: There were test failures: 224 suites, 903 tests, 1 failure, 5 ignored

Total time: 23 minutes 24 seconds
Build step 'Execute shell' marked build as failure
Archiving artifacts
Recording test results
Email was triggered for: Failure
Sending email for trigger: Failure

Lucene java-dev RSS feed   Index | Next | Previous | View Threaded
 
 


Interested in having your list archived? Contact Gossamer Threads
 
  Web Applications & Managed Hosting Powered by Gossamer Threads Inc.