Login | Register For Free | Help
Search for: (Advanced)

Mailing List Archive: Lucene: Java-Dev

[JENKINS] Lucene-Solr-trunk-Linux-Java8-64 - Build # 17 - Still Failing!

 

 

Lucene java-dev RSS feed   Index | Next | Previous | View Threaded


jenkins at sd-datasolutions

Jul 15, 2012, 2:37 PM

Post #1 of 1 (55 views)
Permalink
[JENKINS] Lucene-Solr-trunk-Linux-Java8-64 - Build # 17 - Still Failing!

Build: http://jenkins.sd-datasolutions.de/job/Lucene-Solr-trunk-Linux-Java8-64/17/

1 tests failed.
REGRESSION: org.apache.solr.handler.component.DistributedQueryElevationComponentTest.testDistribSearch

Error Message:
.responseHeader.params.size()==9,9skipped=5,4

Stack Trace:
junit.framework.AssertionFailedError: .responseHeader.params.size()==9,9skipped=5,4
at __randomizedtesting.SeedInfo.seed([78C42DE6616E0B56:F922A3FE16316B6A]:0)
at junit.framework.Assert.fail(Assert.java:50)
at org.apache.solr.BaseDistributedSearchTestCase.compareResponses(BaseDistributedSearchTestCase.java:670)
at org.apache.solr.BaseDistributedSearchTestCase.query(BaseDistributedSearchTestCase.java:392)
at org.apache.solr.handler.component.DistributedQueryElevationComponentTest.doTest(DistributedQueryElevationComponentTest.java:81)
at org.apache.solr.BaseDistributedSearchTestCase.testDistribSearch(BaseDistributedSearchTestCase.java:679)
at sun.reflect.NativeMethodAccessorImpl.invoke0(Native Method)
at sun.reflect.NativeMethodAccessorImpl.invoke(NativeMethodAccessorImpl.java:57)
at sun.reflect.DelegatingMethodAccessorImpl.invoke(DelegatingMethodAccessorImpl.java:43)
at java.lang.reflect.Method.invoke(Method.java:474)
at com.carrotsearch.randomizedtesting.RandomizedRunner.invoke(RandomizedRunner.java:1995)
at com.carrotsearch.randomizedtesting.RandomizedRunner.access$1100(RandomizedRunner.java:132)
at com.carrotsearch.randomizedtesting.RandomizedRunner$6.evaluate(RandomizedRunner.java:818)
at com.carrotsearch.randomizedtesting.RandomizedRunner$7.evaluate(RandomizedRunner.java:877)
at com.carrotsearch.randomizedtesting.RandomizedRunner$8.evaluate(RandomizedRunner.java:891)
at com.carrotsearch.randomizedtesting.rules.SystemPropertiesRestoreRule$1.evaluate(SystemPropertiesRestoreRule.java:53)
at org.apache.lucene.util.TestRuleSetupTeardownChained$1.evaluate(TestRuleSetupTeardownChained.java:50)
at org.apache.lucene.util.TestRuleFieldCacheSanity$1.evaluate(TestRuleFieldCacheSanity.java:32)
at org.apache.lucene.util.AbstractBeforeAfterRule$1.evaluate(AbstractBeforeAfterRule.java:45)
at com.carrotsearch.randomizedtesting.rules.SystemPropertiesInvariantRule$1.evaluate(SystemPropertiesInvariantRule.java:55)
at org.apache.lucene.util.TestRuleReportUncaughtExceptions$1.evaluate(TestRuleReportUncaughtExceptions.java:68)
at org.apache.lucene.util.TestRuleThreadAndTestName$1.evaluate(TestRuleThreadAndTestName.java:48)
at org.apache.lucene.util.TestRuleIgnoreAfterMaxFailures$1.evaluate(TestRuleIgnoreAfterMaxFailures.java:70)
at org.apache.lucene.util.TestRuleMarkFailure$1.evaluate(TestRuleMarkFailure.java:48)
at com.carrotsearch.randomizedtesting.RandomizedRunner.runSingleTest(RandomizedRunner.java:825)
at com.carrotsearch.randomizedtesting.RandomizedRunner.access$700(RandomizedRunner.java:132)
at com.carrotsearch.randomizedtesting.RandomizedRunner$3$1.run(RandomizedRunner.java:671)
at com.carrotsearch.randomizedtesting.RandomizedRunner$3.evaluate(RandomizedRunner.java:697)
at com.carrotsearch.randomizedtesting.RandomizedRunner$4.evaluate(RandomizedRunner.java:736)
at com.carrotsearch.randomizedtesting.RandomizedRunner$5.evaluate(RandomizedRunner.java:747)
at com.carrotsearch.randomizedtesting.rules.SystemPropertiesRestoreRule$1.evaluate(SystemPropertiesRestoreRule.java:53)
at org.apache.lucene.util.AbstractBeforeAfterRule$1.evaluate(AbstractBeforeAfterRule.java:45)
at org.apache.lucene.util.TestRuleReportUncaughtExceptions$1.evaluate(TestRuleReportUncaughtExceptions.java:68)
at org.apache.lucene.util.TestRuleStoreClassName$1.evaluate(TestRuleStoreClassName.java:38)
at org.apache.lucene.util.TestRuleIcuHack$1.evaluate(TestRuleIcuHack.java:51)
at com.carrotsearch.randomizedtesting.rules.SystemPropertiesInvariantRule$1.evaluate(SystemPropertiesInvariantRule.java:55)
at org.apache.lucene.util.TestRuleNoInstanceHooksOverrides$1.evaluate(TestRuleNoInstanceHooksOverrides.java:53)
at org.apache.lucene.util.TestRuleNoStaticHooksShadowing$1.evaluate(TestRuleNoStaticHooksShadowing.java:52)
at org.apache.lucene.util.TestRuleAssertionsRequired$1.evaluate(TestRuleAssertionsRequired.java:36)
at org.apache.lucene.util.TestRuleMarkFailure$1.evaluate(TestRuleMarkFailure.java:48)
at org.apache.lucene.util.TestRuleIgnoreAfterMaxFailures$1.evaluate(TestRuleIgnoreAfterMaxFailures.java:70)
at org.apache.lucene.util.TestRuleIgnoreTestSuites$1.evaluate(TestRuleIgnoreTestSuites.java:55)
at com.carrotsearch.randomizedtesting.RandomizedRunner.runSuite(RandomizedRunner.java:605)
at com.carrotsearch.randomizedtesting.RandomizedRunner.access$400(RandomizedRunner.java:132)
at com.carrotsearch.randomizedtesting.RandomizedRunner$2.run(RandomizedRunner.java:551)




Build Log:
[...truncated 15962 lines...]
[junit4:junit4] Suite: org.apache.solr.handler.component.DistributedQueryElevationComponentTest
[junit4:junit4] FAILURE 2.21s J0 | DistributedQueryElevationComponentTest.testDistribSearch
[junit4:junit4] > Throwable #1: junit.framework.AssertionFailedError: .responseHeader.params.size()==9,9skipped=5,4
[junit4:junit4] > at __randomizedtesting.SeedInfo.seed([78C42DE6616E0B56:F922A3FE16316B6A]:0)
[junit4:junit4] > at junit.framework.Assert.fail(Assert.java:50)
[junit4:junit4] > at org.apache.solr.BaseDistributedSearchTestCase.compareResponses(BaseDistributedSearchTestCase.java:670)
[junit4:junit4] > at org.apache.solr.BaseDistributedSearchTestCase.query(BaseDistributedSearchTestCase.java:392)
[junit4:junit4] > at org.apache.solr.handler.component.DistributedQueryElevationComponentTest.doTest(DistributedQueryElevationComponentTest.java:81)
[junit4:junit4] > at org.apache.solr.BaseDistributedSearchTestCase.testDistribSearch(BaseDistributedSearchTestCase.java:679)
[junit4:junit4] > at sun.reflect.NativeMethodAccessorImpl.invoke0(Native Method)
[junit4:junit4] > at sun.reflect.NativeMethodAccessorImpl.invoke(NativeMethodAccessorImpl.java:57)
[junit4:junit4] > at sun.reflect.DelegatingMethodAccessorImpl.invoke(DelegatingMethodAccessorImpl.java:43)
[junit4:junit4] > at java.lang.reflect.Method.invoke(Method.java:474)
[junit4:junit4] > at com.carrotsearch.randomizedtesting.RandomizedRunner.invoke(RandomizedRunner.java:1995)
[junit4:junit4] > at com.carrotsearch.randomizedtesting.RandomizedRunner.access$1100(RandomizedRunner.java:132)
[junit4:junit4] > at com.carrotsearch.randomizedtesting.RandomizedRunner$6.evaluate(RandomizedRunner.java:818)
[junit4:junit4] > at com.carrotsearch.randomizedtesting.RandomizedRunner$7.evaluate(RandomizedRunner.java:877)
[junit4:junit4] > at com.carrotsearch.randomizedtesting.RandomizedRunner$8.evaluate(RandomizedRunner.java:891)
[junit4:junit4] > at com.carrotsearch.randomizedtesting.rules.SystemPropertiesRestoreRule$1.evaluate(SystemPropertiesRestoreRule.java:53)
[junit4:junit4] > at org.apache.lucene.util.TestRuleSetupTeardownChained$1.evaluate(TestRuleSetupTeardownChained.java:50)
[junit4:junit4] > at org.apache.lucene.util.TestRuleFieldCacheSanity$1.evaluate(TestRuleFieldCacheSanity.java:32)
[junit4:junit4] > at org.apache.lucene.util.AbstractBeforeAfterRule$1.evaluate(AbstractBeforeAfterRule.java:45)
[junit4:junit4] > at com.carrotsearch.randomizedtesting.rules.SystemPropertiesInvariantRule$1.evaluate(SystemPropertiesInvariantRule.java:55)
[junit4:junit4] > at org.apache.lucene.util.TestRuleReportUncaughtExceptions$1.evaluate(TestRuleReportUncaughtExceptions.java:68)
[junit4:junit4] > at org.apache.lucene.util.TestRuleThreadAndTestName$1.evaluate(TestRuleThreadAndTestName.java:48)
[junit4:junit4] > at org.apache.lucene.util.TestRuleIgnoreAfterMaxFailures$1.evaluate(TestRuleIgnoreAfterMaxFailures.java:70)
[junit4:junit4] > at org.apache.lucene.util.TestRuleMarkFailure$1.evaluate(TestRuleMarkFailure.java:48)
[junit4:junit4] > at com.carrotsearch.randomizedtesting.RandomizedRunner.runSingleTest(RandomizedRunner.java:825)
[junit4:junit4] > at com.carrotsearch.randomizedtesting.RandomizedRunner.access$700(RandomizedRunner.java:132)
[junit4:junit4] > at com.carrotsearch.randomizedtesting.RandomizedRunner$3$1.run(RandomizedRunner.java:671)
[junit4:junit4] > at com.carrotsearch.randomizedtesting.RandomizedRunner$3.evaluate(RandomizedRunner.java:697)
[junit4:junit4] > at com.carrotsearch.randomizedtesting.RandomizedRunner$4.evaluate(RandomizedRunner.java:736)
[junit4:junit4] > at com.carrotsearch.randomizedtesting.RandomizedRunner$5.evaluate(RandomizedRunner.java:747)
[junit4:junit4] > at com.carrotsearch.randomizedtesting.rules.SystemPropertiesRestoreRule$1.evaluate(SystemPropertiesRestoreRule.java:53)
[junit4:junit4] > at org.apache.lucene.util.AbstractBeforeAfterRule$1.evaluate(AbstractBeforeAfterRule.java:45)
[junit4:junit4] > at org.apache.lucene.util.TestRuleReportUncaughtExceptions$1.evaluate(TestRuleReportUncaughtExceptions.java:68)
[junit4:junit4] > at org.apache.lucene.util.TestRuleStoreClassName$1.evaluate(TestRuleStoreClassName.java:38)
[junit4:junit4] > at org.apache.lucene.util.TestRuleIcuHack$1.evaluate(TestRuleIcuHack.java:51)
[junit4:junit4] > at com.carrotsearch.randomizedtesting.rules.SystemPropertiesInvariantRule$1.evaluate(SystemPropertiesInvariantRule.java:55)
[junit4:junit4] > at org.apache.lucene.util.TestRuleNoInstanceHooksOverrides$1.evaluate(TestRuleNoInstanceHooksOverrides.java:53)
[junit4:junit4] > at org.apache.lucene.util.TestRuleNoStaticHooksShadowing$1.evaluate(TestRuleNoStaticHooksShadowing.java:52)
[junit4:junit4] > at org.apache.lucene.util.TestRuleAssertionsRequired$1.evaluate(TestRuleAssertionsRequired.java:36)
[junit4:junit4] > at org.apache.lucene.util.TestRuleMarkFailure$1.evaluate(TestRuleMarkFailure.java:48)
[junit4:junit4] > at org.apache.lucene.util.TestRuleIgnoreAfterMaxFailures$1.evaluate(TestRuleIgnoreAfterMaxFailures.java:70)
[junit4:junit4] > at org.apache.lucene.util.TestRuleIgnoreTestSuites$1.evaluate(TestRuleIgnoreTestSuites.java:55)
[junit4:junit4] > at com.carrotsearch.randomizedtesting.RandomizedRunner.runSuite(RandomizedRunner.java:605)
[junit4:junit4] > at com.carrotsearch.randomizedtesting.RandomizedRunner.access$400(RandomizedRunner.java:132)
[junit4:junit4] > at com.carrotsearch.randomizedtesting.RandomizedRunner$2.run(RandomizedRunner.java:551)
[junit4:junit4] >
[junit4:junit4] 2> 5 T26 oas.SolrTestCaseJ4.setUp ###Starting testDistribSearch
[junit4:junit4] 2> 61 T26 oejs.Server.doStart jetty-8.1.2.v20120308
[junit4:junit4] 2> 146 T26 oejs.AbstractConnector.doStart Started SocketConnector [at] 0:54777
[junit4:junit4] 2> 158 T26 oasc.SolrResourceLoader.locateSolrHome JNDI not configured for solr (NoInitialContextEx)
[junit4:junit4] 2> 159 T26 oasc.SolrResourceLoader.locateSolrHome using system property solr.solr.home: /mnt/ssd/jenkins/workspace/Lucene-Solr-trunk-Linux-Java8-64/checkout/solr/build/solr-core/test-files/solr
[junit4:junit4] 2> 162 T26 oasc.SolrResourceLoader.<init> new SolrResourceLoader for deduced Solr Home: '/mnt/ssd/jenkins/workspace/Lucene-Solr-trunk-Linux-Java8-64/checkout/solr/build/solr-core/test-files/solr/'
[junit4:junit4] 2> 172 T26 oass.SolrDispatchFilter.init SolrDispatchFilter.init()
[junit4:junit4] 2> 173 T26 oasc.SolrResourceLoader.locateSolrHome JNDI not configured for solr (NoInitialContextEx)
[junit4:junit4] 2> 173 T26 oasc.SolrResourceLoader.locateSolrHome using system property solr.solr.home: /mnt/ssd/jenkins/workspace/Lucene-Solr-trunk-Linux-Java8-64/checkout/solr/build/solr-core/test-files/solr
[junit4:junit4] 2> 174 T26 oasc.CoreContainer$Initializer.initialize looking for solr.xml: /mnt/ssd/jenkins/workspace/Lucene-Solr-trunk-Linux-Java8-64/checkout/solr/build/solr-core/test-files/solr/solr.xml
[junit4:junit4] 2> 174 T26 oasc.CoreContainer.<init> New CoreContainer 981360415
[junit4:junit4] 2> 175 T26 oasc.CoreContainer.load Loading CoreContainer using Solr Home: '/mnt/ssd/jenkins/workspace/Lucene-Solr-trunk-Linux-Java8-64/checkout/solr/build/solr-core/test-files/solr/'
[junit4:junit4] 2> 175 T26 oasc.SolrResourceLoader.<init> new SolrResourceLoader for directory: '/mnt/ssd/jenkins/workspace/Lucene-Solr-trunk-Linux-Java8-64/checkout/solr/build/solr-core/test-files/solr/'
[junit4:junit4] 2> 194 T26 oasc.CoreContainer.load Registering Log Listener
[junit4:junit4] 2> 209 T26 oashc.HttpShardHandlerFactory.getParameter Setting socketTimeout to: 0
[junit4:junit4] 2> 210 T26 oashc.HttpShardHandlerFactory.getParameter Setting urlScheme to: http://
[junit4:junit4] 2> 210 T26 oashc.HttpShardHandlerFactory.getParameter Setting connTimeout to: 0
[junit4:junit4] 2> 210 T26 oashc.HttpShardHandlerFactory.getParameter Setting maxConnectionsPerHost to: 20
[junit4:junit4] 2> 210 T26 oashc.HttpShardHandlerFactory.getParameter Setting corePoolSize to: 0
[junit4:junit4] 2> 211 T26 oashc.HttpShardHandlerFactory.getParameter Setting maximumPoolSize to: 2147483647
[junit4:junit4] 2> 211 T26 oashc.HttpShardHandlerFactory.getParameter Setting maxThreadIdleTime to: 5
[junit4:junit4] 2> 211 T26 oashc.HttpShardHandlerFactory.getParameter Setting sizeOfQueue to: -1
[junit4:junit4] 2> 211 T26 oashc.HttpShardHandlerFactory.getParameter Setting fairnessPolicy to: false
[junit4:junit4] 2> 211 T26 oascsi.HttpClientUtil.createClient Creating new http client, config:maxConnectionsPerHost=20&maxConnections=10000&socketTimeout=0&connTimeout=0&retry=false
[junit4:junit4] 2> 218 T26 oasc.CoreContainer.create Creating SolrCore 'collection1' using instanceDir: /mnt/ssd/jenkins/workspace/Lucene-Solr-trunk-Linux-Java8-64/checkout/solr/build/solr-core/test-files/solr/collection1
[junit4:junit4] 2> 218 T26 oasc.SolrResourceLoader.<init> new SolrResourceLoader for directory: '/mnt/ssd/jenkins/workspace/Lucene-Solr-trunk-Linux-Java8-64/checkout/solr/build/solr-core/test-files/solr/collection1/'
[junit4:junit4] 2> 219 T26 oasc.SolrResourceLoader.replaceClassLoader Adding 'file:/mnt/ssd/jenkins/workspace/Lucene-Solr-trunk-Linux-Java8-64/checkout/solr/build/solr-core/test-files/solr/collection1/lib/README' to classloader
[junit4:junit4] 2> 219 T26 oasc.SolrResourceLoader.replaceClassLoader Adding 'file:/mnt/ssd/jenkins/workspace/Lucene-Solr-trunk-Linux-Java8-64/checkout/solr/build/solr-core/test-files/solr/collection1/lib/classes/' to classloader
[junit4:junit4] 2> 233 T26 oasc.SolrConfig.<init> Using Lucene MatchVersion: LUCENE_50
[junit4:junit4] 2> 268 T26 oasc.SolrConfig.<init> Loaded SolrConfig: solrconfig-elevate.xml
[junit4:junit4] 2> 269 T26 oass.IndexSchema.readSchema Reading Solr Schema
[junit4:junit4] 2> 274 T26 oass.IndexSchema.readSchema Schema name=example
[junit4:junit4] 2> 415 T26 oass.IndexSchema.readSchema default search field in schema is text
[junit4:junit4] 2> 417 T26 oass.IndexSchema.readSchema unique key field: id
[junit4:junit4] 2> 423 T26 oasc.SolrCore.<init> [collection1] Opening new SolrCore at /mnt/ssd/jenkins/workspace/Lucene-Solr-trunk-Linux-Java8-64/checkout/solr/build/solr-core/test-files/solr/collection1/, dataDir=./org.apache.solr.handler.component.DistributedQueryElevationComponentTest-1342387785656/control/data/
[junit4:junit4] 2> 423 T26 oasc.JmxMonitoredMap.<init> JMX monitoring is enabled. Adding Solr mbeans to JMX Server: com.sun.jmx.mbeanserver.JmxMBeanServer [at] 1890e3
[junit4:junit4] 2> 424 T26 oasc.SolrCore.getNewIndexDir WARNING New index directory detected: old=null new=./org.apache.solr.handler.component.DistributedQueryElevationComponentTest-1342387785656/control/data/index/
[junit4:junit4] 2> 428 T26 oasc.SolrCore.initIndex WARNING [collection1] Solr index directory './org.apache.solr.handler.component.DistributedQueryElevationComponentTest-1342387785656/control/data/index' doesn't exist. Creating new index...
[junit4:junit4] 2> 433 T26 oasc.SolrDeletionPolicy.onCommit SolrDeletionPolicy.onCommit: commits:num=1
[junit4:junit4] 2> commit{dir=MockDirWrapper(org.apache.lucene.store.RAMDirectory [at] 5ecb2a lockFactory=org.apache.lucene.store.SingleInstanceLockFactory [at] 3615d8),segFN=segments_1,generation=1,filenames=[segments_1]
[junit4:junit4] 2> 433 T26 oasc.SolrDeletionPolicy.updateCommits newest commit = 1
[junit4:junit4] 2> 437 T26 oasc.RequestHandlers.initHandlersFromConfig created /update: solr.UpdateRequestHandler
[junit4:junit4] 2> 438 T26 oasc.RequestHandlers.initHandlersFromConfig created /elevate: org.apache.solr.handler.component.SearchHandler
[junit4:junit4] 2> 438 T26 oasc.RequestHandlers.initHandlersFromConfig created /dataElevate: org.apache.solr.handler.component.SearchHandler
[junit4:junit4] 2> 439 T26 oashl.XMLLoader.init xsltCacheLifetimeSeconds=60
[junit4:junit4] 2> 439 T26 oasc.RequestHandlers.initHandlersFromConfig WARNING no default request handler is registered (either '/select' or 'standard')
[junit4:junit4] 2> 441 T26 oasc.SolrCore.initDeprecatedSupport WARNING solrconfig.xml uses deprecated <admin/gettableFiles>, Please update your config to use the ShowFileRequestHandler.
[junit4:junit4] 2> 442 T26 oasc.SolrCore.initDeprecatedSupport WARNING adding ShowFileRequestHandler with hidden files: [.SCHEMA11.XML, SCHEMA-COLLATE.XML, SOLRCONFIG-MASTER1-KEEPONEBACKUP.XML, BAD-SOLRCONFIG-MISSING-SCRIPTFILE.XML, SCHEMA-TRIE.XML, SCHEMA-COPYFIELD-TEST.XML, SOLRCONFIG_CODEC.XML, SCHEMA-STOP-KEEP.XML, KEEP-1.TXT, KEEP-2.TXT, BAD-SCHEMA-UNIQUEKEY-IS-COPYFIELD-DEST.XML, SOLRCONFIG-PHRASESUGGEST.XML, SOLRCONFIG-TERMINDEX.XML, SOLRCONFIG-CACHING.XML, SCHEMA.XML, STOPWORDS.TXT, SOLRCONFIG-SLAVE.XML, BAD-SCHEMA-DUP-FIELDTYPE.XML, SOLRCONFIG-SOLR-749.XML, SCHEMA-TFIDF.XML, SOLRCONFIG-BASIC.XML, SOLRCONFIG-NOCACHE.XML, STEMDICT.TXT, BAD-SCHEMA-DUP-FIELD.XML, THROW.ERROR.ON.ADD.UPDATEPROCESSOR.JS, SCHEMA-REPLICATION2.XML, TRIVIAL.UPDATEPROCESSOR0.JS, SOLRCONFIG-SPELLCHECKER.XML, SCHEMA12.XML, BAD-SCHEMA-OMIT-TF-BUT-NOT-POS.XML, SCHEMA-REQUIRED-FIELDS.XML, TRIVIAL.UPDATEPROCESSOR1.JS, MISSLEADING.EXTENSION.UPDATEPROCESSOR.JS.TXT, SCHEMA-BM25.XML, BAD-SOLRCONFIG-BOGUS-SCRIPTENGINE-NAME.XML, SCHEMA-LMDIRICHLET.XML, BAD_SOLRCONFIG.XML, SOLRCONFIG-MERGEPOLICY.XML, SCHEMA15.XML, SOLRCONFIG-FUNCTIONQUERY.XML, SCHEMASURROUND.XML, SOLRCONFIG_PERF.XML, SCHEMA-REVERSED.XML, SCHEMA-SPELLCHECKER.XML, OPEN-EXCHANGE-RATES.JSON, SCHEMA-BINARYFIELD.XML, BAD-SCHEMA-CODEC-GLOBAL-VS-FT-MISMATCH.XML, SCHEMA-NOT-REQUIRED-UNIQUE-KEY.XML, BAD-SCHEMA-SIM-GLOBAL-VS-FT-MISMATCH.XML, XSLT, SOLRCONFIG-TLOG.XML, SCHEMA-IB.XML, SOLRCONFIG-QUERYSENDER-NOQUERY.XML, BAD-MP-SOLRCONFIG.XML, ELEVATE.XML, SOLRCONFIG-QUERYSENDER.XML, SOLRCONFIG-REQHANDLER.INCL, SOLRCONFIG-PROPINJECT-INDEXDEFAULT.XML, SCHEMA-PHRASESUGGEST.XML, SOLRCONFIG-DELPOLICY2.XML, BAD-SCHEMA-UNIQUEKEY-USES-DEFAULT.XML, STOP-2.TXT, SOLRCONFIG-SLAVE1.XML, SCHEMA-REPLICATION1.XML, SOLRCONFIG-MASTER2.XML, BAD-SOLRCONFIG-INVALID-SCRIPTFILE.XML, MAPPING-ISOLATIN1ACCENT.TXT, SOLRCONFIG-ENABLEPLUGIN.XML, BAD-SCHEMA-DUP-DYNAMICFIELD.XML, SOLRCONFIG-HIGHLIGHT.XML, SOLRCONFIG-PROPINJECT.XML, SCHEMA-MINIMAL.XML, STOPTYPES-2.TXT, HUNSPELL-TEST.AFF, SOLRCONFIG-MASTER1.XML, SYNONYMS.TXT, BAD-SCHEMA-NOT-INDEXED-BUT-TF.XML, ADDFIELDS.UPDATEPROCESSOR.JS, SCHEMA-LUCENEMATCHVERSION.XML, SOLRCONFIG-NATIVELOCK.XML, BAD-SCHEMA-EXTERNAL-FILEFIELD.XML, SOLRCONFIG-REPEATER.XML, FRENCHARTICLES.TXT, SCHEMA_CODEC.XML, SOLRCONFIG-LAZYWRITER.XML, STOP-SNOWBALL.TXT, SOLRCONFIG-MASTER3.XML, BAD-SCHEMA-NOT-INDEXED-BUT-POS.XML, PROTWORDS.TXT, STOPWORDSWRONGENCODING.TXT, SOLRCONFIG-SCRIPT-UPDATEPROCESSOR.XML, SOLRCONFIG-DELPOLICY1.XML, SCHEMA-FOLDING.XML, SOLRCONFIG-XINCLUDE.XML, SOLRCONFIG-ALTDIRECTORY.XML, COMPOUNDDICTIONARY.TXT, SCHEMA-SIM.XML, SOLRCONFIG-SOLCOREPROPERTIES.XML, SOLRCONFIG-TRANSFORMERS.XML, BAD-SCHEMA-NONTEXT-ANALYZER.XML, SOLRCONFIG-SIMPLELOCK.XML, DA_UTF8.XML, STOPWITHBOM.TXT, SOLRCONFIG-SPELLCHECKCOMPONENT.XML, SOLRCONFIG-UPDATE-PROCESSOR-CHAINS.XML, WDFTYPES.TXT, CONDITIONAL.UPDATEPROCESSOR.JS, SCHEMA-CHARFILTERS.XML, OLD_SYNONYMS.TXT, STOP-1.TXT, HYPHENATION.DTD, STOPTYPES-1.TXT, SOLRCONFIG-ELEVATE.XML, DA_COMPOUNDDICTIONARY.TXT, SOLRCONFIG-MASTER.XML, SCHEMA-LMJELINEKMERCER.XML, CURRENCY.XML, BAD-SCHEMA-NOT-INDEXED-BUT-NORMS.XML, PHRASESUGGEST.TXT, SCHEMA-DFR.XML, SCHEMA-NUMERIC.XML, MISSING.FUNCTIONS.UPDATEPROCESSOR.JS, HUNSPELL-TEST.DIC]
[junit4:junit4] 2> 444 T26 oass.SolrIndexSearcher.<init> Opening Searcher [at] 2150730 main
[junit4:junit4] 2> 445 T26 oass.SolrIndexSearcher.getIndexDir WARNING WARNING: Directory impl does not support setting indexDir: org.apache.lucene.store.MockDirectoryWrapper
[junit4:junit4] 2> 446 T26 oasu.CommitTracker.<init> Hard AutoCommit: disabled
[junit4:junit4] 2> 446 T26 oasu.CommitTracker.<init> Soft AutoCommit: disabled
[junit4:junit4] 2> 448 T26 oashc.QueryElevationComponent.inform Loading QueryElevation from: /mnt/ssd/jenkins/workspace/Lucene-Solr-trunk-Linux-Java8-64/checkout/solr/build/solr-core/test-files/solr/collection1/conf/elevate.xml
[junit4:junit4] 2> 460 T26 oashc.QueryElevationComponent.inform Loading QueryElevation from: /mnt/ssd/jenkins/workspace/Lucene-Solr-trunk-Linux-Java8-64/checkout/solr/build/solr-core/test-files/solr/collection1/conf/elevate.xml
[junit4:junit4] 2> 470 T37 oasc.SolrCore.registerSearcher [collection1] Registered new searcher Searcher [at] 2150730 main{StandardDirectoryReader(segments_1:1)}
[junit4:junit4] 2> 470 T26 oasc.CoreContainer.register registering core: collection1
[junit4:junit4] 2> 471 T26 oass.SolrDispatchFilter.init user.dir=/mnt/ssd/jenkins/workspace/Lucene-Solr-trunk-Linux-Java8-64/checkout/solr/build/solr-core/test/J0
[junit4:junit4] 2> 471 T26 oass.SolrDispatchFilter.init SolrDispatchFilter.init() done
[junit4:junit4] 2> 476 T26 oascsi.HttpClientUtil.createClient Creating new http client, config:maxConnections=128&maxConnectionsPerHost=32&followRedirects=false
[junit4:junit4] 2> 480 T26 oejs.Server.doStart jetty-8.1.2.v20120308
[junit4:junit4] 2> 482 T26 oejs.AbstractConnector.doStart Started SocketConnector [at] 0:44550
[junit4:junit4] 2> 482 T26 oasc.SolrResourceLoader.locateSolrHome JNDI not configured for solr (NoInitialContextEx)
[junit4:junit4] 2> 483 T26 oasc.SolrResourceLoader.locateSolrHome using system property solr.solr.home: /mnt/ssd/jenkins/workspace/Lucene-Solr-trunk-Linux-Java8-64/checkout/solr/build/solr-core/test-files/solr
[junit4:junit4] 2> 483 T26 oasc.SolrResourceLoader.<init> new SolrResourceLoader for deduced Solr Home: '/mnt/ssd/jenkins/workspace/Lucene-Solr-trunk-Linux-Java8-64/checkout/solr/build/solr-core/test-files/solr/'
[junit4:junit4] 2> 486 T26 oass.SolrDispatchFilter.init SolrDispatchFilter.init()
[junit4:junit4] 2> 486 T26 oasc.SolrResourceLoader.locateSolrHome JNDI not configured for solr (NoInitialContextEx)
[junit4:junit4] 2> 487 T26 oasc.SolrResourceLoader.locateSolrHome using system property solr.solr.home: /mnt/ssd/jenkins/workspace/Lucene-Solr-trunk-Linux-Java8-64/checkout/solr/build/solr-core/test-files/solr
[junit4:junit4] 2> 487 T26 oasc.CoreContainer$Initializer.initialize looking for solr.xml: /mnt/ssd/jenkins/workspace/Lucene-Solr-trunk-Linux-Java8-64/checkout/solr/build/solr-core/test-files/solr/solr.xml
[junit4:junit4] 2> 487 T26 oasc.CoreContainer.<init> New CoreContainer 863296557
[junit4:junit4] 2> 487 T26 oasc.CoreContainer.load Loading CoreContainer using Solr Home: '/mnt/ssd/jenkins/workspace/Lucene-Solr-trunk-Linux-Java8-64/checkout/solr/build/solr-core/test-files/solr/'
[junit4:junit4] 2> 487 T26 oasc.SolrResourceLoader.<init> new SolrResourceLoader for directory: '/mnt/ssd/jenkins/workspace/Lucene-Solr-trunk-Linux-Java8-64/checkout/solr/build/solr-core/test-files/solr/'
[junit4:junit4] 2> 494 T26 oasc.CoreContainer.load Registering Log Listener
[junit4:junit4] 2> 501 T26 oashc.HttpShardHandlerFactory.getParameter Setting socketTimeout to: 0
[junit4:junit4] 2> 502 T26 oashc.HttpShardHandlerFactory.getParameter Setting urlScheme to: http://
[junit4:junit4] 2> 502 T26 oashc.HttpShardHandlerFactory.getParameter Setting connTimeout to: 0
[junit4:junit4] 2> 502 T26 oashc.HttpShardHandlerFactory.getParameter Setting maxConnectionsPerHost to: 20
[junit4:junit4] 2> 502 T26 oashc.HttpShardHandlerFactory.getParameter Setting corePoolSize to: 0
[junit4:junit4] 2> 502 T26 oashc.HttpShardHandlerFactory.getParameter Setting maximumPoolSize to: 2147483647
[junit4:junit4] 2> 503 T26 oashc.HttpShardHandlerFactory.getParameter Setting maxThreadIdleTime to: 5
[junit4:junit4] 2> 503 T26 oashc.HttpShardHandlerFactory.getParameter Setting sizeOfQueue to: -1
[junit4:junit4] 2> 503 T26 oashc.HttpShardHandlerFactory.getParameter Setting fairnessPolicy to: false
[junit4:junit4] 2> 503 T26 oascsi.HttpClientUtil.createClient Creating new http client, config:maxConnectionsPerHost=20&maxConnections=10000&socketTimeout=0&connTimeout=0&retry=false
[junit4:junit4] 2> 508 T26 oasc.CoreContainer.create Creating SolrCore 'collection1' using instanceDir: /mnt/ssd/jenkins/workspace/Lucene-Solr-trunk-Linux-Java8-64/checkout/solr/build/solr-core/test-files/solr/collection1
[junit4:junit4] 2> 508 T26 oasc.SolrResourceLoader.<init> new SolrResourceLoader for directory: '/mnt/ssd/jenkins/workspace/Lucene-Solr-trunk-Linux-Java8-64/checkout/solr/build/solr-core/test-files/solr/collection1/'
[junit4:junit4] 2> 509 T26 oasc.SolrResourceLoader.replaceClassLoader Adding 'file:/mnt/ssd/jenkins/workspace/Lucene-Solr-trunk-Linux-Java8-64/checkout/solr/build/solr-core/test-files/solr/collection1/lib/README' to classloader
[junit4:junit4] 2> 509 T26 oasc.SolrResourceLoader.replaceClassLoader Adding 'file:/mnt/ssd/jenkins/workspace/Lucene-Solr-trunk-Linux-Java8-64/checkout/solr/build/solr-core/test-files/solr/collection1/lib/classes/' to classloader
[junit4:junit4] 2> 528 T26 oasc.SolrConfig.<init> Using Lucene MatchVersion: LUCENE_50
[junit4:junit4] 2> 568 T26 oasc.SolrConfig.<init> Loaded SolrConfig: solrconfig-elevate.xml
[junit4:junit4] 2> 569 T26 oass.IndexSchema.readSchema Reading Solr Schema
[junit4:junit4] 2> 573 T26 oass.IndexSchema.readSchema Schema name=example
[junit4:junit4] 2> 728 T26 oass.IndexSchema.readSchema default search field in schema is text
[junit4:junit4] 2> 729 T26 oass.IndexSchema.readSchema unique key field: id
[junit4:junit4] 2> 733 T26 oasc.SolrCore.<init> [collection1] Opening new SolrCore at /mnt/ssd/jenkins/workspace/Lucene-Solr-trunk-Linux-Java8-64/checkout/solr/build/solr-core/test-files/solr/collection1/, dataDir=./org.apache.solr.handler.component.DistributedQueryElevationComponentTest-1342387785656/shard0/data/
[junit4:junit4] 2> 733 T26 oasc.JmxMonitoredMap.<init> JMX monitoring is enabled. Adding Solr mbeans to JMX Server: com.sun.jmx.mbeanserver.JmxMBeanServer [at] 1890e3
[junit4:junit4] 2> 734 T26 oasc.SolrCore.getNewIndexDir WARNING New index directory detected: old=null new=./org.apache.solr.handler.component.DistributedQueryElevationComponentTest-1342387785656/shard0/data/index/
[junit4:junit4] 2> 734 T26 oasc.SolrCore.initIndex WARNING [collection1] Solr index directory './org.apache.solr.handler.component.DistributedQueryElevationComponentTest-1342387785656/shard0/data/index' doesn't exist. Creating new index...
[junit4:junit4] 2> 736 T26 oasc.SolrDeletionPolicy.onCommit SolrDeletionPolicy.onCommit: commits:num=1
[junit4:junit4] 2> commit{dir=MockDirWrapper(org.apache.lucene.store.RAMDirectory [at] 53edd9e lockFactory=org.apache.lucene.store.SingleInstanceLockFactory [at] 7e48489),segFN=segments_1,generation=1,filenames=[segments_1]
[junit4:junit4] 2> 736 T26 oasc.SolrDeletionPolicy.updateCommits newest commit = 1
[junit4:junit4] 2> 738 T26 oasc.RequestHandlers.initHandlersFromConfig created /update: solr.UpdateRequestHandler
[junit4:junit4] 2> 739 T26 oasc.RequestHandlers.initHandlersFromConfig created /elevate: org.apache.solr.handler.component.SearchHandler
[junit4:junit4] 2> 739 T26 oasc.RequestHandlers.initHandlersFromConfig created /dataElevate: org.apache.solr.handler.component.SearchHandler
[junit4:junit4] 2> 740 T26 oashl.XMLLoader.init xsltCacheLifetimeSeconds=60
[junit4:junit4] 2> 740 T26 oasc.RequestHandlers.initHandlersFromConfig WARNING no default request handler is registered (either '/select' or 'standard')
[junit4:junit4] 2> 741 T26 oasc.SolrCore.initDeprecatedSupport WARNING solrconfig.xml uses deprecated <admin/gettableFiles>, Please update your config to use the ShowFileRequestHandler.
[junit4:junit4] 2> 743 T26 oasc.SolrCore.initDeprecatedSupport WARNING adding ShowFileRequestHandler with hidden files: [.SCHEMA11.XML, SCHEMA-COLLATE.XML, SOLRCONFIG-MASTER1-KEEPONEBACKUP.XML, BAD-SOLRCONFIG-MISSING-SCRIPTFILE.XML, SCHEMA-TRIE.XML, SCHEMA-COPYFIELD-TEST.XML, SOLRCONFIG_CODEC.XML, SCHEMA-STOP-KEEP.XML, KEEP-1.TXT, KEEP-2.TXT, BAD-SCHEMA-UNIQUEKEY-IS-COPYFIELD-DEST.XML, SOLRCONFIG-PHRASESUGGEST.XML, SOLRCONFIG-TERMINDEX.XML, SOLRCONFIG-CACHING.XML, SCHEMA.XML, STOPWORDS.TXT, SOLRCONFIG-SLAVE.XML, BAD-SCHEMA-DUP-FIELDTYPE.XML, SOLRCONFIG-SOLR-749.XML, SCHEMA-TFIDF.XML, SOLRCONFIG-BASIC.XML, SOLRCONFIG-NOCACHE.XML, STEMDICT.TXT, BAD-SCHEMA-DUP-FIELD.XML, THROW.ERROR.ON.ADD.UPDATEPROCESSOR.JS, SCHEMA-REPLICATION2.XML, TRIVIAL.UPDATEPROCESSOR0.JS, SOLRCONFIG-SPELLCHECKER.XML, SCHEMA12.XML, BAD-SCHEMA-OMIT-TF-BUT-NOT-POS.XML, SCHEMA-REQUIRED-FIELDS.XML, TRIVIAL.UPDATEPROCESSOR1.JS, MISSLEADING.EXTENSION.UPDATEPROCESSOR.JS.TXT, SCHEMA-BM25.XML, BAD-SOLRCONFIG-BOGUS-SCRIPTENGINE-NAME.XML, SCHEMA-LMDIRICHLET.XML, BAD_SOLRCONFIG.XML, SOLRCONFIG-MERGEPOLICY.XML, SCHEMA15.XML, SOLRCONFIG-FUNCTIONQUERY.XML, SCHEMASURROUND.XML, SOLRCONFIG_PERF.XML, SCHEMA-REVERSED.XML, SCHEMA-SPELLCHECKER.XML, OPEN-EXCHANGE-RATES.JSON, SCHEMA-BINARYFIELD.XML, BAD-SCHEMA-CODEC-GLOBAL-VS-FT-MISMATCH.XML, SCHEMA-NOT-REQUIRED-UNIQUE-KEY.XML, BAD-SCHEMA-SIM-GLOBAL-VS-FT-MISMATCH.XML, XSLT, SOLRCONFIG-TLOG.XML, SCHEMA-IB.XML, SOLRCONFIG-QUERYSENDER-NOQUERY.XML, BAD-MP-SOLRCONFIG.XML, ELEVATE.XML, SOLRCONFIG-QUERYSENDER.XML, SOLRCONFIG-REQHANDLER.INCL, SOLRCONFIG-PROPINJECT-INDEXDEFAULT.XML, SCHEMA-PHRASESUGGEST.XML, SOLRCONFIG-DELPOLICY2.XML, BAD-SCHEMA-UNIQUEKEY-USES-DEFAULT.XML, STOP-2.TXT, SOLRCONFIG-SLAVE1.XML, SCHEMA-REPLICATION1.XML, SOLRCONFIG-MASTER2.XML, BAD-SOLRCONFIG-INVALID-SCRIPTFILE.XML, MAPPING-ISOLATIN1ACCENT.TXT, SOLRCONFIG-ENABLEPLUGIN.XML, BAD-SCHEMA-DUP-DYNAMICFIELD.XML, SOLRCONFIG-HIGHLIGHT.XML, SOLRCONFIG-PROPINJECT.XML, SCHEMA-MINIMAL.XML, STOPTYPES-2.TXT, HUNSPELL-TEST.AFF, SOLRCONFIG-MASTER1.XML, SYNONYMS.TXT, BAD-SCHEMA-NOT-INDEXED-BUT-TF.XML, ADDFIELDS.UPDATEPROCESSOR.JS, SCHEMA-LUCENEMATCHVERSION.XML, SOLRCONFIG-NATIVELOCK.XML, BAD-SCHEMA-EXTERNAL-FILEFIELD.XML, SOLRCONFIG-REPEATER.XML, FRENCHARTICLES.TXT, SCHEMA_CODEC.XML, SOLRCONFIG-LAZYWRITER.XML, STOP-SNOWBALL.TXT, SOLRCONFIG-MASTER3.XML, BAD-SCHEMA-NOT-INDEXED-BUT-POS.XML, PROTWORDS.TXT, STOPWORDSWRONGENCODING.TXT, SOLRCONFIG-SCRIPT-UPDATEPROCESSOR.XML, SOLRCONFIG-DELPOLICY1.XML, SCHEMA-FOLDING.XML, SOLRCONFIG-XINCLUDE.XML, SOLRCONFIG-ALTDIRECTORY.XML, COMPOUNDDICTIONARY.TXT, SCHEMA-SIM.XML, SOLRCONFIG-SOLCOREPROPERTIES.XML, SOLRCONFIG-TRANSFORMERS.XML, BAD-SCHEMA-NONTEXT-ANALYZER.XML, SOLRCONFIG-SIMPLELOCK.XML, DA_UTF8.XML, STOPWITHBOM.TXT, SOLRCONFIG-SPELLCHECKCOMPONENT.XML, SOLRCONFIG-UPDATE-PROCESSOR-CHAINS.XML, WDFTYPES.TXT, CONDITIONAL.UPDATEPROCESSOR.JS, SCHEMA-CHARFILTERS.XML, OLD_SYNONYMS.TXT, STOP-1.TXT, HYPHENATION.DTD, STOPTYPES-1.TXT, SOLRCONFIG-ELEVATE.XML, DA_COMPOUNDDICTIONARY.TXT, SOLRCONFIG-MASTER.XML, SCHEMA-LMJELINEKMERCER.XML, CURRENCY.XML, BAD-SCHEMA-NOT-INDEXED-BUT-NORMS.XML, PHRASESUGGEST.TXT, SCHEMA-DFR.XML, SCHEMA-NUMERIC.XML, MISSING.FUNCTIONS.UPDATEPROCESSOR.JS, HUNSPELL-TEST.DIC]
[junit4:junit4] 2> 745 T26 oass.SolrIndexSearcher.<init> Opening Searcher [at] 3de8c9a main
[junit4:junit4] 2> 745 T26 oass.SolrIndexSearcher.getIndexDir WARNING WARNING: Directory impl does not support setting indexDir: org.apache.lucene.store.MockDirectoryWrapper
[junit4:junit4] 2> 746 T26 oasu.CommitTracker.<init> Hard AutoCommit: disabled
[junit4:junit4] 2> 746 T26 oasu.CommitTracker.<init> Soft AutoCommit: disabled
[junit4:junit4] 2> 747 T26 oashc.QueryElevationComponent.inform Loading QueryElevation from: /mnt/ssd/jenkins/workspace/Lucene-Solr-trunk-Linux-Java8-64/checkout/solr/build/solr-core/test-files/solr/collection1/conf/elevate.xml
[junit4:junit4] 2> 757 T26 oashc.QueryElevationComponent.inform Loading QueryElevation from: /mnt/ssd/jenkins/workspace/Lucene-Solr-trunk-Linux-Java8-64/checkout/solr/build/solr-core/test-files/solr/collection1/conf/elevate.xml
[junit4:junit4] 2> 766 T47 oasc.SolrCore.registerSearcher [collection1] Registered new searcher Searcher [at] 3de8c9a main{StandardDirectoryReader(segments_1:1)}
[junit4:junit4] 2> 769 T26 oasc.CoreContainer.register registering core: collection1
[junit4:junit4] 2> 769 T26 oass.SolrDispatchFilter.init user.dir=/mnt/ssd/jenkins/workspace/Lucene-Solr-trunk-Linux-Java8-64/checkout/solr/build/solr-core/test/J0
[junit4:junit4] 2> 770 T26 oass.SolrDispatchFilter.init SolrDispatchFilter.init() done
[junit4:junit4] 2> 770 T26 oascsi.HttpClientUtil.createClient Creating new http client, config:maxConnections=128&maxConnectionsPerHost=32&followRedirects=false
[junit4:junit4] 2> 774 T26 oejs.Server.doStart jetty-8.1.2.v20120308
[junit4:junit4] 2> 776 T26 oejs.AbstractConnector.doStart Started SocketConnector [at] 0:55976
[junit4:junit4] 2> 777 T26 oasc.SolrResourceLoader.locateSolrHome JNDI not configured for solr (NoInitialContextEx)
[junit4:junit4] 2> 778 T26 oasc.SolrResourceLoader.locateSolrHome using system property solr.solr.home: /mnt/ssd/jenkins/workspace/Lucene-Solr-trunk-Linux-Java8-64/checkout/solr/build/solr-core/test-files/solr
[junit4:junit4] 2> 780 T26 oasc.SolrResourceLoader.<init> new SolrResourceLoader for deduced Solr Home: '/mnt/ssd/jenkins/workspace/Lucene-Solr-trunk-Linux-Java8-64/checkout/solr/build/solr-core/test-files/solr/'
[junit4:junit4] 2> 784 T26 oass.SolrDispatchFilter.init SolrDispatchFilter.init()
[junit4:junit4] 2> 785 T26 oasc.SolrResourceLoader.locateSolrHome JNDI not configured for solr (NoInitialContextEx)
[junit4:junit4] 2> 785 T26 oasc.SolrResourceLoader.locateSolrHome using system property solr.solr.home: /mnt/ssd/jenkins/workspace/Lucene-Solr-trunk-Linux-Java8-64/checkout/solr/build/solr-core/test-files/solr
[junit4:junit4] 2> 785 T26 oasc.CoreContainer$Initializer.initialize looking for solr.xml: /mnt/ssd/jenkins/workspace/Lucene-Solr-trunk-Linux-Java8-64/checkout/solr/build/solr-core/test-files/solr/solr.xml
[junit4:junit4] 2> 786 T26 oasc.CoreContainer.<init> New CoreContainer 1449784761
[junit4:junit4] 2> 786 T26 oasc.CoreContainer.load Loading CoreContainer using Solr Home: '/mnt/ssd/jenkins/workspace/Lucene-Solr-trunk-Linux-Java8-64/checkout/solr/build/solr-core/test-files/solr/'
[junit4:junit4] 2> 786 T26 oasc.SolrResourceLoader.<init> new SolrResourceLoader for directory: '/mnt/ssd/jenkins/workspace/Lucene-Solr-trunk-Linux-Java8-64/checkout/solr/build/solr-core/test-files/solr/'
[junit4:junit4] 2> 794 T26 oasc.CoreContainer.load Registering Log Listener
[junit4:junit4] 2> 800 T26 oashc.HttpShardHandlerFactory.getParameter Setting socketTimeout to: 0
[junit4:junit4] 2> 801 T26 oashc.HttpShardHandlerFactory.getParameter Setting urlScheme to: http://
[junit4:junit4] 2> 801 T26 oashc.HttpShardHandlerFactory.getParameter Setting connTimeout to: 0
[junit4:junit4] 2> 801 T26 oashc.HttpShardHandlerFactory.getParameter Setting maxConnectionsPerHost to: 20
[junit4:junit4] 2> 801 T26 oashc.HttpShardHandlerFactory.getParameter Setting corePoolSize to: 0
[junit4:junit4] 2> 801 T26 oashc.HttpShardHandlerFactory.getParameter Setting maximumPoolSize to: 2147483647
[junit4:junit4] 2> 802 T26 oashc.HttpShardHandlerFactory.getParameter Setting maxThreadIdleTime to: 5
[junit4:junit4] 2> 802 T26 oashc.HttpShardHandlerFactory.getParameter Setting sizeOfQueue to: -1
[junit4:junit4] 2> 802 T26 oashc.HttpShardHandlerFactory.getParameter Setting fairnessPolicy to: false
[junit4:junit4] 2> 802 T26 oascsi.HttpClientUtil.createClient Creating new http client, config:maxConnectionsPerHost=20&maxConnections=10000&socketTimeout=0&connTimeout=0&retry=false
[junit4:junit4] 2> 807 T26 oasc.CoreContainer.create Creating SolrCore 'collection1' using instanceDir: /mnt/ssd/jenkins/workspace/Lucene-Solr-trunk-Linux-Java8-64/checkout/solr/build/solr-core/test-files/solr/collection1
[junit4:junit4] 2> 807 T26 oasc.SolrResourceLoader.<init> new SolrResourceLoader for directory: '/mnt/ssd/jenkins/workspace/Lucene-Solr-trunk-Linux-Java8-64/checkout/solr/build/solr-core/test-files/solr/collection1/'
[junit4:junit4] 2> 808 T26 oasc.SolrResourceLoader.replaceClassLoader Adding 'file:/mnt/ssd/jenkins/workspace/Lucene-Solr-trunk-Linux-Java8-64/checkout/solr/build/solr-core/test-files/solr/collection1/lib/README' to classloader
[junit4:junit4] 2> 809 T26 oasc.SolrResourceLoader.replaceClassLoader Adding 'file:/mnt/ssd/jenkins/workspace/Lucene-Solr-trunk-Linux-Java8-64/checkout/solr/build/solr-core/test-files/solr/collection1/lib/classes/' to classloader
[junit4:junit4] 2> 829 T26 oasc.SolrConfig.<init> Using Lucene MatchVersion: LUCENE_50
[junit4:junit4] 2> 868 T26 oasc.SolrConfig.<init> Loaded SolrConfig: solrconfig-elevate.xml
[junit4:junit4] 2> 869 T26 oass.IndexSchema.readSchema Reading Solr Schema
[junit4:junit4] 2> 873 T26 oass.IndexSchema.readSchema Schema name=example
[junit4:junit4] 2> 1029 T26 oass.IndexSchema.readSchema default search field in schema is text
[junit4:junit4] 2> 1032 T26 oass.IndexSchema.readSchema unique key field: id
[junit4:junit4] 2> 1037 T26 oasc.SolrCore.<init> [collection1] Opening new SolrCore at /mnt/ssd/jenkins/workspace/Lucene-Solr-trunk-Linux-Java8-64/checkout/solr/build/solr-core/test-files/solr/collection1/, dataDir=./org.apache.solr.handler.component.DistributedQueryElevationComponentTest-1342387785656/shard1/data/
[junit4:junit4] 2> 1038 T26 oasc.JmxMonitoredMap.<init> JMX monitoring is enabled. Adding Solr mbeans to JMX Server: com.sun.jmx.mbeanserver.JmxMBeanServer [at] 1890e3
[junit4:junit4] 2> 1038 T26 oasc.SolrCore.getNewIndexDir WARNING New index directory detected: old=null new=./org.apache.solr.handler.component.DistributedQueryElevationComponentTest-1342387785656/shard1/data/index/
[junit4:junit4] 2> 1039 T26 oasc.SolrCore.initIndex WARNING [collection1] Solr index directory './org.apache.solr.handler.component.DistributedQueryElevationComponentTest-1342387785656/shard1/data/index' doesn't exist. Creating new index...
[junit4:junit4] 2> 1041 T26 oasc.SolrDeletionPolicy.onCommit SolrDeletionPolicy.onCommit: commits:num=1
[junit4:junit4] 2> commit{dir=MockDirWrapper(NRTCachingDirectory(org.apache.lucene.store.RAMDirectory [at] 5350266 lockFactory=org.apache.lucene.store.SingleInstanceLockFactory [at] 703a928; maxCacheMB=0.8193359375 maxMergeSizeMB=0.9697265625)),segFN=segments_1,generation=1,filenames=[segments_1]
[junit4:junit4] 2> 1041 T26 oasc.SolrDeletionPolicy.updateCommits newest commit = 1
[junit4:junit4] 2> 1043 T26 oasc.RequestHandlers.initHandlersFromConfig created /update: solr.UpdateRequestHandler
[junit4:junit4] 2> 1044 T26 oasc.RequestHandlers.initHandlersFromConfig created /elevate: org.apache.solr.handler.component.SearchHandler
[junit4:junit4] 2> 1044 T26 oasc.RequestHandlers.initHandlersFromConfig created /dataElevate: org.apache.solr.handler.component.SearchHandler
[junit4:junit4] 2> 1045 T26 oashl.XMLLoader.init xsltCacheLifetimeSeconds=60
[junit4:junit4] 2> 1045 T26 oasc.RequestHandlers.initHandlersFromConfig WARNING no default request handler is registered (either '/select' or 'standard')
[junit4:junit4] 2> 1046 T26 oasc.SolrCore.initDeprecatedSupport WARNING solrconfig.xml uses deprecated <admin/gettableFiles>, Please update your config to use the ShowFileRequestHandler.
[junit4:junit4] 2> 1047 T26 oasc.SolrCore.initDeprecatedSupport WARNING adding ShowFileRequestHandler with hidden files: [.SCHEMA11.XML, SCHEMA-COLLATE.XML, SOLRCONFIG-MASTER1-KEEPONEBACKUP.XML, BAD-SOLRCONFIG-MISSING-SCRIPTFILE.XML, SCHEMA-TRIE.XML, SCHEMA-COPYFIELD-TEST.XML, SOLRCONFIG_CODEC.XML, SCHEMA-STOP-KEEP.XML, KEEP-1.TXT, KEEP-2.TXT, BAD-SCHEMA-UNIQUEKEY-IS-COPYFIELD-DEST.XML, SOLRCONFIG-PHRASESUGGEST.XML, SOLRCONFIG-TERMINDEX.XML, SOLRCONFIG-CACHING.XML, SCHEMA.XML, STOPWORDS.TXT, SOLRCONFIG-SLAVE.XML, BAD-SCHEMA-DUP-FIELDTYPE.XML, SOLRCONFIG-SOLR-749.XML, SCHEMA-TFIDF.XML, SOLRCONFIG-BASIC.XML, SOLRCONFIG-NOCACHE.XML, STEMDICT.TXT, BAD-SCHEMA-DUP-FIELD.XML, THROW.ERROR.ON.ADD.UPDATEPROCESSOR.JS, SCHEMA-REPLICATION2.XML, TRIVIAL.UPDATEPROCESSOR0.JS, SOLRCONFIG-SPELLCHECKER.XML, SCHEMA12.XML, BAD-SCHEMA-OMIT-TF-BUT-NOT-POS.XML, SCHEMA-REQUIRED-FIELDS.XML, TRIVIAL.UPDATEPROCESSOR1.JS, MISSLEADING.EXTENSION.UPDATEPROCESSOR.JS.TXT, SCHEMA-BM25.XML, BAD-SOLRCONFIG-BOGUS-SCRIPTENGINE-NAME.XML, SCHEMA-LMDIRICHLET.XML, BAD_SOLRCONFIG.XML, SOLRCONFIG-MERGEPOLICY.XML, SCHEMA15.XML, SOLRCONFIG-FUNCTIONQUERY.XML, SCHEMASURROUND.XML, SOLRCONFIG_PERF.XML, SCHEMA-REVERSED.XML, SCHEMA-SPELLCHECKER.XML, OPEN-EXCHANGE-RATES.JSON, SCHEMA-BINARYFIELD.XML, BAD-SCHEMA-CODEC-GLOBAL-VS-FT-MISMATCH.XML, SCHEMA-NOT-REQUIRED-UNIQUE-KEY.XML, BAD-SCHEMA-SIM-GLOBAL-VS-FT-MISMATCH.XML, XSLT, SOLRCONFIG-TLOG.XML, SCHEMA-IB.XML, SOLRCONFIG-QUERYSENDER-NOQUERY.XML, BAD-MP-SOLRCONFIG.XML, ELEVATE.XML, SOLRCONFIG-QUERYSENDER.XML, SOLRCONFIG-REQHANDLER.INCL, SOLRCONFIG-PROPINJECT-INDEXDEFAULT.XML, SCHEMA-PHRASESUGGEST.XML, SOLRCONFIG-DELPOLICY2.XML, BAD-SCHEMA-UNIQUEKEY-USES-DEFAULT.XML, STOP-2.TXT, SOLRCONFIG-SLAVE1.XML, SCHEMA-REPLICATION1.XML, SOLRCONFIG-MASTER2.XML, BAD-SOLRCONFIG-INVALID-SCRIPTFILE.XML, MAPPING-ISOLATIN1ACCENT.TXT, SOLRCONFIG-ENABLEPLUGIN.XML, BAD-SCHEMA-DUP-DYNAMICFIELD.XML, SOLRCONFIG-HIGHLIGHT.XML, SOLRCONFIG-PROPINJECT.XML, SCHEMA-MINIMAL.XML, STOPTYPES-2.TXT, HUNSPELL-TEST.AFF, SOLRCONFIG-MASTER1.XML, SYNONYMS.TXT, BAD-SCHEMA-NOT-INDEXED-BUT-TF.XML, ADDFIELDS.UPDATEPROCESSOR.JS, SCHEMA-LUCENEMATCHVERSION.XML, SOLRCONFIG-NATIVELOCK.XML, BAD-SCHEMA-EXTERNAL-FILEFIELD.XML, SOLRCONFIG-REPEATER.XML, FRENCHARTICLES.TXT, SCHEMA_CODEC.XML, SOLRCONFIG-LAZYWRITER.XML, STOP-SNOWBALL.TXT, SOLRCONFIG-MASTER3.XML, BAD-SCHEMA-NOT-INDEXED-BUT-POS.XML, PROTWORDS.TXT, STOPWORDSWRONGENCODING.TXT, SOLRCONFIG-SCRIPT-UPDATEPROCESSOR.XML, SOLRCONFIG-DELPOLICY1.XML, SCHEMA-FOLDING.XML, SOLRCONFIG-XINCLUDE.XML, SOLRCONFIG-ALTDIRECTORY.XML, COMPOUNDDICTIONARY.TXT, SCHEMA-SIM.XML, SOLRCONFIG-SOLCOREPROPERTIES.XML, SOLRCONFIG-TRANSFORMERS.XML, BAD-SCHEMA-NONTEXT-ANALYZER.XML, SOLRCONFIG-SIMPLELOCK.XML, DA_UTF8.XML, STOPWITHBOM.TXT, SOLRCONFIG-SPELLCHECKCOMPONENT.XML, SOLRCONFIG-UPDATE-PROCESSOR-CHAINS.XML, WDFTYPES.TXT, CONDITIONAL.UPDATEPROCESSOR.JS, SCHEMA-CHARFILTERS.XML, OLD_SYNONYMS.TXT, STOP-1.TXT, HYPHENATION.DTD, STOPTYPES-1.TXT, SOLRCONFIG-ELEVATE.XML, DA_COMPOUNDDICTIONARY.TXT, SOLRCONFIG-MASTER.XML, SCHEMA-LMJELINEKMERCER.XML, CURRENCY.XML, BAD-SCHEMA-NOT-INDEXED-BUT-NORMS.XML, PHRASESUGGEST.TXT, SCHEMA-DFR.XML, SCHEMA-NUMERIC.XML, MISSING.FUNCTIONS.UPDATEPROCESSOR.JS, HUNSPELL-TEST.DIC]
[junit4:junit4] 2> 1050 T26 oass.SolrIndexSearcher.<init> Opening Searcher [at] 5be463a main
[junit4:junit4] 2> 1050 T26 oass.SolrIndexSearcher.getIndexDir WARNING WARNING: Directory impl does not support setting indexDir: org.apache.lucene.store.MockDirectoryWrapper
[junit4:junit4] 2> 1051 T26 oasu.CommitTracker.<init> Hard AutoCommit: disabled
[junit4:junit4] 2> 1052 T26 oasu.CommitTracker.<init> Soft AutoCommit: disabled
[junit4:junit4] 2> 1052 T26 oashc.QueryElevationComponent.inform Loading QueryElevation from: /mnt/ssd/jenkins/workspace/Lucene-Solr-trunk-Linux-Java8-64/checkout/solr/build/solr-core/test-files/solr/collection1/conf/elevate.xml
[junit4:junit4] 2> 1060 T26 oashc.QueryElevationComponent.inform Loading QueryElevation from: /mnt/ssd/jenkins/workspace/Lucene-Solr-trunk-Linux-Java8-64/checkout/solr/build/solr-core/test-files/solr/collection1/conf/elevate.xml
[junit4:junit4] 2> 1069 T57 oasc.SolrCore.registerSearcher [collection1] Registered new searcher Searcher [at] 5be463a main{StandardDirectoryReader(segments_1:1)}
[junit4:junit4] 2> 1069 T26 oasc.CoreContainer.register registering core: collection1
[junit4:junit4] 2> 1071 T26 oass.SolrDispatchFilter.init user.dir=/mnt/ssd/jenkins/workspace/Lucene-Solr-trunk-Linux-Java8-64/checkout/solr/build/solr-core/test/J0
[junit4:junit4] 2> 1071 T26 oass.SolrDispatchFilter.init SolrDispatchFilter.init() done
[junit4:junit4] 2> 1072 T26 oascsi.HttpClientUtil.createClient Creating new http client, config:maxConnections=128&maxConnectionsPerHost=32&followRedirects=false
[junit4:junit4] 2> 1084 T26 oejs.Server.doStart jetty-8.1.2.v20120308
[junit4:junit4] 2> 1088 T26 oejs.AbstractConnector.doStart Started SocketConnector [at] 0:52369
[junit4:junit4] 2> 1089 T26 oasc.SolrResourceLoader.locateSolrHome JNDI not configured for solr (NoInitialContextEx)
[junit4:junit4] 2> 1090 T26 oasc.SolrResourceLoader.locateSolrHome using system property solr.solr.home: /mnt/ssd/jenkins/workspace/Lucene-Solr-trunk-Linux-Java8-64/checkout/solr/build/solr-core/test-files/solr
[junit4:junit4] 2> 1090 T26 oasc.SolrResourceLoader.<init> new SolrResourceLoader for deduced Solr Home: '/mnt/ssd/jenkins/workspace/Lucene-Solr-trunk-Linux-Java8-64/checkout/solr/build/solr-core/test-files/solr/'
[junit4:junit4] 2> 1094 T26 oass.SolrDispatchFilter.init SolrDispatchFilter.init()
[junit4:junit4] 2> 1095 T26 oasc.SolrResourceLoader.locateSolrHome JNDI not configured for solr (NoInitialContextEx)
[junit4:junit4] 2> 1095 T26 oasc.SolrResourceLoader.locateSolrHome using system property solr.solr.home: /mnt/ssd/jenkins/workspace/Lucene-Solr-trunk-Linux-Java8-64/checkout/solr/build/solr-core/test-files/solr
[junit4:junit4] 2> 1095 T26 oasc.CoreContainer$Initializer.initialize looking for solr.xml: /mnt/ssd/jenkins/workspace/Lucene-Solr-trunk-Linux-Java8-64/checkout/solr/build/solr-core/test-files/solr/solr.xml
[junit4:junit4] 2> 1096 T26 oasc.CoreContainer.<init> New CoreContainer 817716618
[junit4:junit4] 2> 1096 T26 oasc.CoreContainer.load Loading CoreContainer using Solr Home: '/mnt/ssd/jenkins/workspace/Lucene-Solr-trunk-Linux-Java8-64/checkout/solr/build/solr-core/test-files/solr/'
[junit4:junit4] 2> 1096 T26 oasc.SolrResourceLoader.<init> new SolrResourceLoader for directory: '/mnt/ssd/jenkins/workspace/Lucene-Solr-trunk-Linux-Java8-64/checkout/solr/build/solr-core/test-files/solr/'
[junit4:junit4] 2> 1104 T26 oasc.CoreContainer.load Registering Log Listener
[junit4:junit4] 2> 1114 T26 oashc.HttpShardHandlerFactory.getParameter Setting socketTimeout to: 0
[junit4:junit4] 2> 1114 T26 oashc.HttpShardHandlerFactory.getParameter Setting urlScheme to: http://
[junit4:junit4] 2> 1115 T26 oashc.HttpShardHandlerFactory.getParameter Setting connTimeout to: 0
[junit4:junit4] 2> 1115 T26 oashc.HttpShardHandlerFactory.getParameter Setting maxConnectionsPerHost to: 20
[junit4:junit4] 2> 1115 T26 oashc.HttpShardHandlerFactory.getParameter Setting corePoolSize to: 0
[junit4:junit4] 2> 1116 T26 oashc.HttpShardHandlerFactory.getParameter Setting maximumPoolSize to: 2147483647
[junit4:junit4] 2> 1116 T26 oashc.HttpShardHandlerFactory.getParameter Setting maxThreadIdleTime to: 5
[junit4:junit4] 2> 1116 T26 oashc.HttpShardHandlerFactory.getParameter Setting sizeOfQueue to: -1
[junit4:junit4] 2> 1116 T26 oashc.HttpShardHandlerFactory.getParameter Setting fairnessPolicy to: false
[junit4:junit4] 2> 1117 T26 oascsi.HttpClientUtil.createClient Creating new http client, config:maxConnectionsPerHost=20&maxConnections=10000&socketTimeout=0&connTimeout=0&retry=false
[junit4:junit4] 2> 1124 T26 oasc.CoreContainer.create Creating SolrCore 'collection1' using instanceDir: /mnt/ssd/jenkins/workspace/Lucene-Solr-trunk-Linux-Java8-64/checkout/solr/build/solr-core/test-files/solr/collection1
[junit4:junit4] 2> 1124 T26 oasc.SolrResourceLoader.<init> new SolrResourceLoader for directory: '/mnt/ssd/jenkins/workspace/Lucene-Solr-trunk-Linux-Java8-64/checkout/solr/build/solr-core/test-files/solr/collection1/'
[junit4:junit4] 2> 1125 T26 oasc.SolrResourceLoader.replaceClassLoader Adding 'file:/mnt/ssd/jenkins/workspace/Lucene-Solr-trunk-Linux-Java8-64/checkout/solr/build/solr-core/test-files/solr/collection1/lib/README' to classloader
[junit4:junit4] 2> 1125 T26 oasc.SolrResourceLoader.replaceClassLoader Adding 'file:/mnt/ssd/jenkins/workspace/Lucene-Solr-trunk-Linux-Java8-64/checkout/solr/build/solr-core/test-files/solr/collection1/lib/classes/' to classloader
[junit4:junit4] 2> 1145 T26 oasc.SolrConfig.<init> Using Lucene MatchVersion: LUCENE_50
[junit4:junit4] 2> 1184 T26 oasc.SolrConfig.<init> Loaded SolrConfig: solrconfig-elevate.xml
[junit4:junit4] 2> 1184 T26 oass.IndexSchema.readSchema Reading Solr Schema
[junit4:junit4] 2> 1188 T26 oass.IndexSchema.readSchema Schema name=example
[junit4:junit4] 2> 1347 T26 oass.IndexSchema.readSchema default search field in schema is text
[junit4:junit4] 2> 1349 T26 oass.IndexSchema.readSchema unique key field: id
[junit4:junit4] 2> 1354 T26 oasc.SolrCore.<init> [collection1] Opening new SolrCore at /mnt/ssd/jenkins/workspace/Lucene-Solr-trunk-Linux-Java8-64/checkout/solr/build/solr-core/test-files/solr/collection1/, dataDir=./org.apache.solr.handler.component.DistributedQueryElevationComponentTest-1342387785656/shard2/data/
[junit4:junit4] 2> 1355 T26 oasc.JmxMonitoredMap.<init> JMX monitoring is enabled. Adding Solr mbeans to JMX Server: com.sun.jmx.mbeanserver.JmxMBeanServer [at] 1890e3
[junit4:junit4] 2> 1356 T26 oasc.SolrCore.getNewIndexDir WARNING New index directory detected: old=null new=./org.apache.solr.handler.component.DistributedQueryElevationComponentTest-1342387785656/shard2/data/index/
[junit4:junit4] 2> 1356 T26 oasc.SolrCore.initIndex WARNING [collection1] Solr index directory './org.apache.solr.handler.component.DistributedQueryElevationComponentTest-1342387785656/shard2/data/index' doesn't exist. Creating new index...
[junit4:junit4] 2> 1358 T26 oasc.SolrDeletionPolicy.onCommit SolrDeletionPolicy.onCommit: commits:num=1
[junit4:junit4] 2> commit{dir=MockDirWrapper(org.apache.lucene.store.RAMDirectory [at] 658b4dc lockFactory=org.apache.lucene.store.SingleInstanceLockFactory [at] 339d0f2),segFN=segments_1,generation=1,filenames=[segments_1]
[junit4:junit4] 2> 1358 T26 oasc.SolrDeletionPolicy.updateCommits newest commit = 1
[junit4:junit4] 2> 1360 T26 oasc.RequestHandlers.initHandlersFromConfig created /update: solr.UpdateRequestHandler
[junit4:junit4] 2> 1360 T26 oasc.RequestHandlers.initHandlersFromConfig created /elevate: org.apache.solr.handler.component.SearchHandler
[junit4:junit4] 2> 1361 T26 oasc.RequestHandlers.initHandlersFromConfig created /dataElevate: org.apache.solr.handler.component.SearchHandler
[junit4:junit4] 2> 1361 T26 oashl.XMLLoader.init xsltCacheLifetimeSeconds=60
[junit4:junit4] 2> 1362 T26 oasc.RequestHandlers.initHandlersFromConfig WARNING no default request handler is registered (either '/select' or 'standard')
[junit4:junit4] 2> 1363 T26 oasc.SolrCore.initDeprecatedSupport WARNING solrconfig.xml uses deprecated <admin/gettableFiles>, Please update your config to use the ShowFileRequestHandler.
[junit4:junit4] 2> 1365 T26 oasc.SolrCore.initDeprecatedSupport WARNING adding ShowFileRequestHandler with hidden files: [.SCHEMA11.XML, SCHEMA-COLLATE.XML, SOLRCONFIG-MASTER1-KEEPONEBACKUP.XML, BAD-SOLRCONFIG-MISSING-SCRIPTFILE.XML, SCHEMA-TRIE.XML, SCHEMA-COPYFIELD-TEST.XML, SOLRCONFIG_CODEC.XML, SCHEMA-STOP-KEEP.XML, KEEP-1.TXT, KEEP-2.TXT, BAD-SCHEMA-UNIQUEKEY-IS-COPYFIELD-DEST.XML, SOLRCONFIG-PHRASESUGGEST.XML, SOLRCONFIG-TERMINDEX.XML, SOLRCONFIG-CACHING.XML, SCHEMA.XML, STOPWORDS.TXT, SOLRCONFIG-SLAVE.XML, BAD-SCHEMA-DUP-FIELDTYPE.XML, SOLRCONFIG-SOLR-749.XML, SCHEMA-TFIDF.XML, SOLRCONFIG-BASIC.XML, SOLRCONFIG-NOCACHE.XML, STEMDICT.TXT, BAD-SCHEMA-DUP-FIELD.XML, THROW.ERROR.ON.ADD.UPDATEPROCESSOR.JS, SCHEMA-REPLICATION2.XML, TRIVIAL.UPDATEPROCESSOR0.JS, SOLRCONFIG-SPELLCHECKER.XML, SCHEMA12.XML, BAD-SCHEMA-OMIT-TF-BUT-NOT-POS.XML, SCHEMA-REQUIRED-FIELDS.XML, TRIVIAL.UPDATEPROCESSOR1.JS, MISSLEADING.EXTENSION.UPDATEPROCESSOR.JS.TXT, SCHEMA-BM25.XML, BAD-SOLRCONFIG-BOGUS-SCRIPTENGINE-NAME.XML, SCHEMA-LMDIRICHLET.XML, BAD_SOLRCONFIG.XML, SOLRCONFIG-MERGEPOLICY.XML, SCHEMA15.XML, SOLRCONFIG-FUNCTIONQUERY.XML, SCHEMASURROUND.XML, SOLRCONFIG_PERF.XML, SCHEMA-REVERSED.XML, SCHEMA-SPELLCHECKER.XML, OPEN-EXCHANGE-RATES.JSON, SCHEMA-BINARYFIELD.XML, BAD-SCHEMA-CODEC-GLOBAL-VS-FT-MISMATCH.XML, SCHEMA-NOT-REQUIRED-UNIQUE-KEY.XML, BAD-SCHEMA-SIM-GLOBAL-VS-FT-MISMATCH.XML, XSLT, SOLRCONFIG-TLOG.XML, SCHEMA-IB.XML, SOLRCONFIG-QUERYSENDER-NOQUERY.XML, BAD-MP-SOLRCONFIG.XML, ELEVATE.XML, SOLRCONFIG-QUERYSENDER.XML, SOLRCONFIG-REQHANDLER.INCL, SOLRCONFIG-PROPINJECT-INDEXDEFAULT.XML, SCHEMA-PHRASESUGGEST.XML, SOLRCONFIG-DELPOLICY2.XML, BAD-SCHEMA-UNIQUEKEY-USES-DEFAULT.XML, STOP-2.TXT, SOLRCONFIG-SLAVE1.XML, SCHEMA-REPLICATION1.XML, SOLRCONFIG-MASTER2.XML, BAD-SOLRCONFIG-INVALID-SCRIPTFILE.XML, MAPPING-ISOLATIN1ACCENT.TXT, SOLRCONFIG-ENABLEPLUGIN.XML, BAD-SCHEMA-DUP-DYNAMICFIELD.XML, SOLRCONFIG-HIGHLIGHT.XML, SOLRCONFIG-PROPINJECT.XML, SCHEMA-MINIMAL.XML, STOPTYPES-2.TXT, HUNSPELL-TEST.AFF, SOLRCONFIG-MASTER1.XML, SYNONYMS.TXT, BAD-SCHEMA-NOT-INDEXED-BUT-TF.XML, ADDFIELDS.UPDATEPROCESSOR.JS, SCHEMA-LUCENEMATCHVERSION.XML, SOLRCONFIG-NATIVELOCK.XML, BAD-SCHEMA-EXTERNAL-FILEFIELD.XML, SOLRCONFIG-REPEATER.XML, FRENCHARTICLES.TXT, SCHEMA_CODEC.XML, SOLRCONFIG-LAZYWRITER.XML, STOP-SNOWBALL.TXT, SOLRCONFIG-MASTER3.XML, BAD-SCHEMA-NOT-INDEXED-BUT-POS.XML, PROTWORDS.TXT, STOPWORDSWRONGENCODING.TXT, SOLRCONFIG-SCRIPT-UPDATEPROCESSOR.XML, SOLRCONFIG-DELPOLICY1.XML, SCHEMA-FOLDING.XML, SOLRCONFIG-XINCLUDE.XML, SOLRCONFIG-ALTDIRECTORY.XML, COMPOUNDDICTIONARY.TXT, SCHEMA-SIM.XML, SOLRCONFIG-SOLCOREPROPERTIES.XML, SOLRCONFIG-TRANSFORMERS.XML, BAD-SCHEMA-NONTEXT-ANALYZER.XML, SOLRCONFIG-SIMPLELOCK.XML, DA_UTF8.XML, STOPWITHBOM.TXT, SOLRCONFIG-SPELLCHECKCOMPONENT.XML, SOLRCONFIG-UPDATE-PROCESSOR-CHAINS.XML, WDFTYPES.TXT, CONDITIONAL.UPDATEPROCESSOR.JS, SCHEMA-CHARFILTERS.XML, OLD_SYNONYMS.TXT, STOP-1.TXT, HYPHENATION.DTD, STOPTYPES-1.TXT, SOLRCONFIG-ELEVATE.XML, DA_COMPOUNDDICTIONARY.TXT, SOLRCONFIG-MASTER.XML, SCHEMA-LMJELINEKMERCER.XML, CURRENCY.XML, BAD-SCHEMA-NOT-INDEXED-BUT-NORMS.XML, PHRASESUGGEST.TXT, SCHEMA-DFR.XML, SCHEMA-NUMERIC.XML, MISSING.FUNCTIONS.UPDATEPROCESSOR.JS, HUNSPELL-TEST.DIC]
[junit4:junit4] 2> 1367 T26 oass.SolrIndexSearcher.<init> Opening Searcher [at] 1dfa77a main
[junit4:junit4] 2> 1367 T26 oass.SolrIndexSearcher.getIndexDir WARNING WARNING: Directory impl does not support setting indexDir: org.apache.lucene.store.MockDirectoryWrapper
[junit4:junit4] 2> 1368 T26 oasu.CommitTracker.<init> Hard AutoCommit: disabled
[junit4:junit4] 2> 1368 T26 oasu.CommitTracker.<init> Soft AutoCommit: disabled
[junit4:junit4] 2> 1369 T26 oashc.QueryElevationComponent.inform Loading QueryElevation from: /mnt/ssd/jenkins/workspace/Lucene-Solr-trunk-Linux-Java8-64/checkout/solr/build/solr-core/test-files/solr/collection1/conf/elevate.xml
[junit4:junit4] 2> 1378 T26 oashc.QueryElevationComponent.inform Loading QueryElevation from: /mnt/ssd/jenkins/workspace/Lucene-Solr-trunk-Linux-Java8-64/checkout/solr/build/solr-core/test-files/solr/collection1/conf/elevate.xml
[junit4:junit4] 2> 1384 T67 oasc.SolrCore.registerSearcher [collection1] Registered new searcher Searcher [at] 1dfa77a main{StandardDirectoryReader(segments_1:1)}
[junit4:junit4] 2> 1384 T26 oasc.CoreContainer.register registering core: collection1
[junit4:junit4] 2> 1385 T26 oass.SolrDispatchFilter.init user.dir=/mnt/ssd/jenkins/workspace/Lucene-Solr-trunk-Linux-Java8-64/checkout/solr/build/solr-core/test/J0
[junit4:junit4] 2> 1385 T26 oass.SolrDispatchFilter.init SolrDispatchFilter.init() done
[junit4:junit4] 2> 1385 T26 oascsi.HttpClientUtil.createClient Creating new http client, config:maxConnections=128&maxConnectionsPerHost=32&followRedirects=false
[junit4:junit4] 2> ASYNC NEW_CORE C1 name=collection1 org.apache.solr.core.SolrCore [at] 453d36a
[junit4:junit4] 2> 1525 T30 C1 oasu.DirectUpdateHandler2.deleteAll [collection1] REMOVING ALL DOCUMENTS FROM INDEX
[junit4:junit4] 2> 1527 T30 C1 oasc.SolrDeletionPolicy.onInit SolrDeletionPolicy.onInit: commits:num=1
[junit4:junit4] 2> commit{dir=MockDirWrapper(org.apache.lucene.store.RAMDirectory [at] 5ecb2a lockFactory=org.apache.lucene.store.SingleInstanceLockFactory [at] 3615d8),segFN=segments_1,generation=1,filenames=[segments_1]
[junit4:junit4] 2> 1527 T30 C1 oasc.SolrDeletionPolicy.updateCommits newest commit = 1
[junit4:junit4] 2> 1528 T30 C1 UPDATE [collection1] webapp=/solr path=/update params={wt=javabin&version=2} {deleteByQuery=*:*} 0 29
[junit4:junit4] 2> ASYNC NEW_CORE C2 name=collection1 org.apache.solr.core.SolrCore [at] cb7446
[junit4:junit4] 2> 1550 T40 C2 oasu.DirectUpdateHandler2.deleteAll [collection1] REMOVING ALL DOCUMENTS FROM INDEX
[junit4:junit4] 2> 1552 T40 C2 oasc.SolrDeletionPolicy.onInit SolrDeletionPolicy.onInit: commits:num=1
[junit4:junit4] 2> commit{dir=MockDirWrapper(org.apache.lucene.store.RAMDirectory [at] 53edd9e lockFactory=org.apache.lucene.store.SingleInstanceLockFactory [at] 7e48489),segFN=segments_1,generation=1,filenames=[segments_1]
[junit4:junit4] 2> 1553 T40 C2 oasc.SolrDeletionPolicy.updateCommits newest commit = 1
[junit4:junit4] 2> 1553 T40 C2 UPDATE [collection1] webapp=/solr path=/update params={wt=javabin&version=2} {deleteByQuery=*:*} 0 3
[junit4:junit4] 2> ASYNC NEW_CORE C3 name=collection1 org.apache.solr.core.SolrCore [at] 599ef69
[junit4:junit4] 2> 1557 T50 C3 oasu.DirectUpdateHandler2.deleteAll [collection1] REMOVING ALL DOCUMENTS FROM INDEX
[junit4:junit4] 2> 1559 T50 C3 oasc.SolrDeletionPolicy.onInit SolrDeletionPolicy.onInit: commits:num=1
[junit4:junit4] 2> commit{dir=MockDirWrapper(NRTCachingDirectory(org.apache.lucene.store.RAMDirectory [at] 5350266 lockFactory=org.apache.lucene.store.SingleInstanceLockFactory [at] 703a928; maxCacheMB=0.8193359375 maxMergeSizeMB=0.9697265625)),segFN=segments_1,generation=1,filenames=[segments_1]
[junit4:junit4] 2> 1560 T50 C3 oasc.SolrDeletionPolicy.updateCommits newest commit = 1
[junit4:junit4] 2> 1560 T50 C3 UPDATE [collection1] webapp=/solr path=/update params={wt=javabin&version=2} {deleteByQuery=*:*} 0 3
[junit4:junit4] 2> ASYNC NEW_CORE C4 name=collection1 org.apache.solr.core.SolrCore [at] 429d4e7
[junit4:junit4] 2> 1566 T60 C4 oasu.DirectUpdateHandler2.deleteAll [collection1] REMOVING ALL DOCUMENTS FROM INDEX
[junit4:junit4] 2> 1567 T60 C4 oasc.SolrDeletionPolicy.onInit SolrDeletionPolicy.onInit: commits:num=1
[junit4:junit4] 2> commit{dir=MockDirWrapper(org.apache.lucene.store.RAMDirectory [at] 658b4dc lockFactory=org.apache.lucene.store.SingleInstanceLockFactory [at] 339d0f2),segFN=segments_1,generation=1,filenames=[segments_1]
[junit4:junit4] 2> 1568 T60 C4 oasc.SolrDeletionPolicy.updateCommits newest commit = 1
[junit4:junit4] 2> 1568 T60 C4 UPDATE [collection1] webapp=/solr path=/update params={wt=javabin&version=2} {deleteByQuery=*:*} 0 3
[junit4:junit4] 2> 1590 T30 C1 UPDATE [collection1] webapp=/solr path=/update params={wt=javabin&version=2} {add=[1]} 0 19
[junit4:junit4] 2> 1599 T40 C2 UPDATE [collection1] webapp=/solr path=/update params={wt=javabin&version=2} {add=[1]} 0 5
[junit4:junit4] 2> 1604 T30 C1 UPDATE [collection1] webapp=/solr path=/update params={wt=javabin&version=2} {add=[2]} 0 2
[junit4:junit4] 2> 1609 T50 C3 UPDATE [collection1] webapp=/solr path=/update params={wt=javabin&version=2} {add=[2]} 0 2
[junit4:junit4] 2> 1613 T30 C1 UPDATE [collection1] webapp=/solr path=/update params={wt=javabin&version=2} {add=[3]} 0 1
[junit4:junit4] 2> 1617 T60 C4 UPDATE [collection1] webapp=/solr path=/update params={wt=javabin&version=2} {add=[3]} 0 2
[junit4:junit4] 2> 1620 T30 C1 UPDATE [collection1] webapp=/solr path=/update params={wt=javabin&version=2} {add=[4]} 0 0
[junit4:junit4] 2> 1624 T40 C2 UPDATE [collection1] webapp=/solr path=/update params={wt=javabin&version=2} {add=[4]} 0 1
[junit4:junit4] 2> 1627 T30 C1 UPDATE [collection1] webapp=/solr path=/update params={wt=javabin&version=2} {add=[5]} 0 1
[junit4:junit4] 2> 1630 T50 C3 UPDATE [collection1] webapp=/solr path=/update params={wt=javabin&version=2} {add=[5]} 0 0
[junit4:junit4] 2> 1634 T30 C1 UPDATE [collection1] webapp=/solr path=/update params={wt=javabin&version=2} {add=[6]} 0 1
[junit4:junit4] 2> 1637 T60 C4 UPDATE [collection1] webapp=/solr path=/update params={wt=javabin&version=2} {add=[6]} 0 1
[junit4:junit4] 2> 1641 T30 C1 UPDATE [collection1] webapp=/solr path=/update params={wt=javabin&version=2} {add=[7]} 0 1
[junit4:junit4] 2> 1644 T60 C4 UPDATE [collection1] webapp=/solr path=/update params={wt=javabin&version=2} {add=[7]} 0 1
[junit4:junit4] 2> 1651 T30 C1 oasu.DirectUpdateHandler2.commit start commit{flags=0,version=0,optimize=false,openSearcher=true,waitSearcher=true,expungeDeletes=false,softCommit=false}
[junit4:junit4] 2> 1700 T30 C1 oasc.SolrDeletionPolicy.onCommit SolrDeletionPolicy.onCommit: commits:num=2
[junit4:junit4] 2> commit{dir=MockDirWrapper(org.apache.lucene.store.RAMDirectory [at] 5ecb2a lockFactory=org.apache.lucene.store.SingleInstanceLockFactory [at] 3615d8),segFN=segments_1,generation=1,filenames=[segments_1]
[junit4:junit4] 2> commit{dir=MockDirWrapper(org.apache.lucene.store.RAMDirectory [at] 5ecb2a lockFactory=org.apache.lucene.store.SingleInstanceLockFactory [at] 3615d8),segFN=segments_2,generation=2,filenames=[._0.si, segments_2, _0_Lucene40_0.prx, _0_nrm.cfs, _0_Lucene40_0.tim, _0_Lucene40_0.frq, _0_Memory_0.ram, _0_Lucene40_0.tip, _0_nrm.cfe, _0.fnm, _0.fdt, _0.fdx]
[junit4:junit4] 2> 1700 T30 C1 oasc.SolrDeletionPolicy.updateCommits newest commit = 2
[junit4:junit4] 2> 1711 T30 C1 oass.SolrIndexSearcher.<init> Opening Searcher [at] 4342dc7 main
[junit4:junit4] 2> 1711 T30 C1 oass.SolrIndexSearcher.getIndexDir WARNING WARNING: Directory impl does not support setting indexDir: org.apache.lucene.store.MockDirectoryWrapper
[junit4:junit4] 2> 1712 T30 C1 oasu.DirectUpdateHandler2.commit end_commit_flush
[junit4:junit4] 2> 1713 T37 oasc.SolrCore.registerSearcher [collection1] Registered new searcher Searcher [at] 4342dc7 main{StandardDirectoryReader(segments_2:4 _0(5.0):C7)}
[junit4:junit4] 2> 1713 T30 C1 UPDATE [collection1] webapp=/solr path=/update params={waitSearcher=true&version=2&commit=true&wt=javabin&softCommit=false} {commit=} 0 62
[junit4:junit4] 2> 1716 T40 C2 oasu.DirectUpdateHandler2.commit start commit{flags=0,version=0,optimize=false,openSearcher=true,waitSearcher=true,expungeDeletes=false,softCommit=false}
[junit4:junit4] 2> 1719 T40 C2 oasc.SolrDeletionPolicy.onCommit SolrDeletionPolicy.onCommit: commits:num=2
[junit4:junit4] 2> commit{dir=MockDirWrapper(org.apache.lucene.store.RAMDirectory [at] 53edd9e lockFactory=org.apache.lucene.store.SingleInstanceLockFactory [at] 7e48489),segFN=segments_1,generation=1,filenames=[segments_1]
[junit4:junit4] 2> commit{dir=MockDirWrapper(org.apache.lucene.store.RAMDirectory [at] 53edd9e lockFactory=org.apache.lucene.store.SingleInstanceLockFactory [at] 7e48489),segFN=segments_2,generation=2,filenames=[._0.si, segments_2, _0_Lucene40_0.prx, _0_nrm.cfs, _0_Lucene40_0.tim, _0_Lucene40_0.frq, _0_Memory_0.ram, _0_Lucene40_0.tip, _0_nrm.cfe, _0.fnm, _0.fdt, _0.fdx]
[junit4:junit4] 2> 1720 T40 C2 oasc.SolrDeletionPolicy.updateCommits newest commit = 2
[junit4:junit4] 2> 1721 T40 C2 oass.SolrIndexSearcher.<init> Opening Searcher [at] 2b7e4dc main
[junit4:junit4] 2> 1721 T40 C2 oass.SolrIndexSearcher.getIndexDir WARNING WARNING: Directory impl does not support setting indexDir: org.apache.lucene.store.MockDirectoryWrapper
[junit4:junit4] 2> 1722 T40 C2 oasu.DirectUpdateHandler2.commit end_commit_flush
[junit4:junit4] 2> 1722 T47 oasc.SolrCore.registerSearcher [collection1] Registered new searcher Searcher [at] 2b7e4dc main{StandardDirectoryReader(segments_2:4 _0(5.0):C2)}
[junit4:junit4] 2> 1723 T40 C2 UPDATE [collection1] webapp=/solr path=/update params={waitSearcher=true&version=2&commit=true&wt=javabin&softCommit=false} {commit=} 0 7
[junit4:junit4] 2> 1726 T50 C3 oasu.DirectUpdateHandler2.commit start commit{flags=0,version=0,optimize=false,openSearcher=true,waitSearcher=true,expungeDeletes=false,softCommit=false}
[junit4:junit4] 2> 1730 T50 C3 oasc.SolrDeletionPolicy.onCommit SolrDeletionPolicy.onCommit: commits:num=2
[junit4:junit4] 2> commit{dir=MockDirWrapper(NRTCachingDirectory(org.apache.lucene.store.RAMDirectory [at] 5350266 lockFactory=org.apache.lucene.store.SingleInstanceLockFactory [at] 703a928; maxCacheMB=0.8193359375 maxMergeSizeMB=0.9697265625)),segFN=segments_1,generation=1,filenames=[segments_1]
[junit4:junit4] 2> commit{dir=MockDirWrapper(NRTCachingDirectory(org.apache.lucene.store.RAMDirectory [at] 5350266 lockFactory=org.apache.lucene.store.SingleInstanceLockFactory [at] 703a928; maxCacheMB=0.8193359375 maxMergeSizeMB=0.9697265625)),segFN=segments_2,generation=2,filenames=[._0.si, segments_2, _0_Lucene40_0.prx, _0_nrm.cfs, _0_Lucene40_0.tim, _0_Lucene40_0.frq, _0_Memory_0.ram, _0_Lucene40_0.tip, _0_nrm.cfe, _0.fnm, _0.fdt, _0.fdx]
[junit4:junit4] 2> 1731 T50 C3 oasc.SolrDeletionPolicy.updateCommits newest commit = 2
[junit4:junit4] 2> 1733 T50 C3 oass.SolrIndexSearcher.<init> Opening Searcher [at] 1210a9 main
[junit4:junit4] 2> 1733 T50 C3 oass.SolrIndexSearcher.getIndexDir WARNING WARNING: Directory impl does not support setting indexDir: org.apache.lucene.store.MockDirectoryWrapper
[junit4:junit4] 2> 1734 T50 C3 oasu.DirectUpdateHandler2.commit end_commit_flush
[junit4:junit4] 2> 1735 T57 oasc.SolrCore.registerSearcher [collection1] Registered new searcher Searcher [at] 1210a9 main{StandardDirectoryReader(segments_2:4 _0(5.0):C2)}
[junit4:junit4] 2> 1735 T50 C3 UPDATE [collection1] webapp=/solr path=/update params={waitSearcher=true&version=2&commit=true&wt=javabin&softCommit=false} {commit=} 0 9
[junit4:junit4] 2> 1739 T60 C4 oasu.DirectUpdateHandler2.commit start commit{flags=0,version=0,optimize=false,openSearcher=true,waitSearcher=true,expungeDeletes=false,softCommit=false}
[junit4:junit4] 2> 1741 T60 C4 oasc.SolrDeletionPolicy.onCommit SolrDeletionPolicy.onCommit: commits:num=2
[junit4:junit4] 2> commit{dir=MockDirWrapper(org.apache.lucene.store.RAMDirectory [at] 658b4dc lockFactory=org.apache.lucene.store.SingleInstanceLockFactory [at] 339d0f2),segFN=segments_1,generation=1,filenames=[segments_1]
[junit4:junit4] 2> commit{dir=MockDirWrapper(org.apache.lucene.store.RAMDirectory [at] 658b4dc lockFactory=org.apache.lucene.store.SingleInstanceLockFactory [at] 339d0f2),segFN=segments_2,generation=2,filenames=[._0.si, segments_2, _0_Lucene40_0.prx, _0_nrm.cfs, _0_Lucene40_0.tim, _0_Lucene40_0.frq, _0_Memory_0.ram, _0_Lucene40_0.tip, _0_nrm.cfe, _0.fnm, _0.fdt, _0.fdx]
[junit4:junit4] 2> 1742 T60 C4 oasc.SolrDeletionPolicy.updateCommits newest commit = 2
[junit4:junit4] 2> 1743 T60 C4 oass.SolrIndexSearcher.<init> Opening Searcher [at] 5288160 main
[junit4:junit4] 2> 1744 T60 C4 oass.SolrIndexSearcher.getIndexDir WARNING WARNING: Directory impl does not support setting indexDir: org.apache.lucene.store.MockDirectoryWrapper
[junit4:junit4] 2> 1744 T60 C4 oasu.DirectUpdateHandler2.commit end_commit_flush
[junit4:junit4] 2> 1745 T67 oasc.SolrCore.registerSearcher [collection1] Registered new searcher Searcher [at] 5288160 main{StandardDirectoryReader(segments_2:4 _0(5.0):C3)}
[junit4:junit4] 2> 1746 T60 C4 UPDATE [collection1] webapp=/solr path=/update params={waitSearcher=true&version=2&commit=true&wt=javabin&softCommit=false} {commit=} 0 8
[junit4:junit4] 2> 1802 T30 C1 REQ [collection1] webapp=/solr path=/elevate params={wt=javabin&sort=id+desc&shards.qt=/elevate&q=*:*&qt=/elevate&version=2&rows=500&fl=id,+score,+[elevated]&distrib=false} hits=7 status=0 QTime=47
[junit4:junit4] 2> 1847 T61 C4 REQ [collection1] webapp=/solr path=/elevate params={sort=id+desc&shards.qt=/elevate&q=*:*&qt=/elevate&version=2&rows=500&isShard=true&shard.url=localhost:52369/solr&wt=javabin&fl=id,score&fsv=true&distrib=false&NOW=1342387787456&start=0} hits=3 status=0 QTime=20
[junit4:junit4] 2> 1848 T41 C2 REQ [collection1] webapp=/solr path=/elevate params={sort=id+desc&shards.qt=/elevate&q=*:*&qt=/elevate&version=2&rows=500&isShard=true&shard.url=[::1]:33332/solr|localhost:44550/solr&wt=javabin&fl=id,score&fsv=true&distrib=false&NOW=1342387787456&start=0} hits=2 status=0 QTime=20
[junit4:junit4] 2> 1854 T51 C3 REQ [collection1] webapp=/solr path=/elevate params={sort=id+desc&shards.qt=/elevate&q=*:*&qt=/elevate&version=2&rows=500&isShard=true&shard.url=localhost:55976/solr|[::1]:33332/solr&wt=javabin&fl=id,score&fsv=true&distrib=false&NOW=1342387787456&start=0} hits=2 status=0 QTime=4
[junit4:junit4] 2> 1866 T61 C4 REQ [collection1] webapp=/solr path=/elevate params={ids=6.0,3.0,7.0&shards.qt=/elevate&q=*:*&qt=/elevate&version=2&rows=500&isShard=true&shard.url=localhost:52369/solr&wt=javabin&fl=id,+score,+[elevated]&distrib=false&NOW=1342387787456} status=0 QTime=1
[junit4:junit4] 2> 1866 T41 C2 REQ [collection1] webapp=/solr path=/elevate params={ids=4.0,1.0&shards.qt=/elevate&q=*:*&qt=/elevate&version=2&rows=500&isShard=true&shard.url=[::1]:33332/solr|localhost:44550/solr&wt=javabin&fl=id,+score,+[elevated]&distrib=false&NOW=1342387787456} status=0 QTime=1
[junit4:junit4] 2> 1869 T51 C3 REQ [collection1] webapp=/solr path=/elevate params={ids=2.0,5.0&shards.qt=/elevate&q=*:*&qt=/elevate&version=2&rows=500&isShard=true&shard.url=localhost:55976/solr|[::1]:33332/solr&wt=javabin&fl=id,+score,+[elevated]&distrib=false&NOW=1342387787456} status=0 QTime=1
[junit4:junit4] 2> 1871 T50 C3 REQ [collection1] webapp=/solr path=/elevate params={wt=javabin&sort=id+desc&shards.qt=/elevate&q=*:*&qt=/elevate&version=2&shards=[::1]:33332/solr|localhost:44550/solr,localhost:55976/solr|[::1]:33332/solr,localhost:52369/solr&rows=500&fl=id,+score,+[elevated]} status=0 QTime=65
[junit4:junit4] 2> 1875 T26 oas.BaseDistributedSearchTestCase.compareResponses SEVERE Mismatched responses:
[junit4:junit4] 2> {responseHeader={status=0,QTime=65,params={wt=javabin,sort=id desc,shards.qt=/elevate,q=*:*,qt=/elevate,version=2,shards=[::1]:33332/solr|localhost:44550/solr,localhost:55976/solr|[::1]:33332/solr,localhost:52369/solr,rows=500,fl=id, score, [elevated]}},response={numFound=7,start=0,maxScore=1.0,docs=[SolrDocument{id=7.0, [elevated]=false, score=1.0}, SolrDocument{id=6.0, [elevated]=false, score=1.0}, SolrDocument{id=5.0, [elevated]=false, score=1.0}, SolrDocument{id=4.0, [elevated]=false, score=1.0}, SolrDocument{id=3.0, [elevated]=false, score=1.0}, SolrDocument{id=2.0, [elevated]=false, score=1.0}, SolrDocument{id=1.0, [elevated]=false, score=1.0}]}}
[junit4:junit4] 2> {responseHeader={status=0,QTime=47,params={wt=javabin,sort=id desc,shards.qt=/elevate,q=*:*,qt=/elevate,version=2,rows=500,fl=id, score, [elevated],distrib=false}},response={numFound=7,start=0,maxScore=1.0,docs=[SolrDocument{id=7.0, score=1.0, [elevated]=false}, SolrDocument{id=6.0, score=1.0, [elevated]=false}, SolrDocument{id=5.0, score=1.0, [elevated]=false}, SolrDocument{id=4.0, score=1.0, [elevated]=false}, SolrDocument{id=3.0, score=1.0, [elevated]=false}, SolrDocument{id=2.0, score=1.0, [elevated]=false}, SolrDocument{id=1.0, score=1.0, [elevated]=false}]}}
[junit4:junit4] 2> 1881 T26 oasc.CoreContainer.shutdown Shutting down CoreContainer instance=981360415
[junit4:junit4] 2> 1881 T26 oasc.SolrCore.close [collection1] CLOSING SolrCore org.apache.solr.core.SolrCore [at] 453d36a
[junit4:junit4] 2> 1883 T26 oasc.SolrCore.closeSearcher [collection1] Closing main searcher on request.
[junit4:junit4] 2> 1884 T26 oasu.DirectUpdateHandler2.close closing DirectUpdateHandler2{commits=1,autocommits=0,soft autocommits=0,optimizes=0,rollbacks=0,expungeDeletes=0,docsPending=0,adds=0,deletesById=0,deletesByQuery=0,errors=0,cumulative_adds=7,cumulative_deletesById=0,cumulative_deletesByQuery=1,cumulative_errors=0}
[junit4:junit4] 2> 1897 T26 oejsh.ContextHandler.doStop stopped o.e.j.s.ServletContextHandler{/solr,null}
[junit4:junit4] 2> 1953 T26 oasc.CoreContainer.shutdown Shutting down CoreContainer instance=863296557
[junit4:junit4] 2> 1954 T26 oasc.SolrCore.close [collection1] CLOSING SolrCore org.apache.solr.core.SolrCore [at] cb7446
[junit4:junit4] 2> 1960 T26 oasc.SolrCore.closeSearcher [collection1] Closing main searcher on request.
[junit4:junit4] 2> 1961 T26 oasu.DirectUpdateHandler2.close closing DirectUpdateHandler2{commits=1,autocommits=0,soft autocommits=0,optimizes=0,rollbacks=0,expungeDeletes=0,docsPending=0,adds=0,deletesById=0,deletesByQuery=0,errors=0,cumulative_adds=2,cumulative_deletesById=0,cumulative_deletesByQuery=1,cumulative_errors=0}
[junit4:junit4] 2> 1966 T26 oejsh.ContextHandler.doStop stopped o.e.j.s.ServletContextHandler{/solr,null}
[junit4:junit4] 2> 2019 T26 oasc.CoreContainer.shutdown Shutting down CoreContainer instance=1449784761
[junit4:junit4] 2> 2019 T26 oasc.SolrCore.close [collection1] CLOSING SolrCore org.apache.solr.core.SolrCore [at] 599ef69
[junit4:junit4] 2> 2020 T26 oasc.SolrCore.closeSearcher [collection1] Closing main searcher on request.
[junit4:junit4] 2> 2021 T26 oasu.DirectUpdateHandler2.close closing DirectUpdateHandler2{commits=1,autocommits=0,soft autocommits=0,optimizes=0,rollbacks=0,expungeDeletes=0,docsPending=0,adds=0,deletesById=0,deletesByQuery=0,errors=0,cumulative_adds=2,cumulative_deletesById=0,cumulative_deletesByQuery=1,cumulative_errors=0}
[junit4:junit4] 2> 2027 T26 oejsh.ContextHandler.doStop stopped o.e.j.s.ServletContextHandler{/solr,null}
[junit4:junit4] 2> 2079 T26 oasc.CoreContainer.shutdown Shutting down CoreContainer instance=817716618
[junit4:junit4] 2> 2080 T26 oasc.SolrCore.close [collection1] CLOSING SolrCore org.apache.solr.core.SolrCore [at] 429d4e7
[junit4:junit4] 2> 2081 T26 oasc.SolrCore.closeSearcher [collection1] Closing main searcher on request.
[junit4:junit4] 2> 2082 T26 oasu.DirectUpdateHandler2.close closing DirectUpdateHandler2{commits=1,autocommits=0,soft autocommits=0,optimizes=0,rollbacks=0,expungeDeletes=0,docsPending=0,adds=0,deletesById=0,deletesByQuery=0,errors=0,cumulative_adds=3,cumulative_deletesById=0,cumulative_deletesByQuery=1,cumulative_errors=0}
[junit4:junit4] 2> 2086 T26 oejsh.ContextHandler.doStop stopped o.e.j.s.ServletContextHandler{/solr,null}
[junit4:junit4] 2> 2139 T26 oas.SolrTestCaseJ4.tearDown ###Ending testDistribSearch
[junit4:junit4] 2> NOTE: reproduce with: ant test -Dtestcase=DistributedQueryElevationComponentTest -Dtests.method=testDistribSearch -Dtests.seed=78C42DE6616E0B56 -Dtests.multiplier=3 -Dtests.slow=true -Dtests.locale=ar_LY -Dtests.timezone=Africa/Lagos -Dtests.file.encoding=UTF-8
[junit4:junit4] 2>
[junit4:junit4] > (@AfterClass output)
[junit4:junit4] 2> 2212 T26 oas.SolrTestCaseJ4.deleteCore ###deleteCore
[junit4:junit4] 2> NOTE: test params are: codec=Lucene40: {text=PostingsFormat(name=Memory doPackFST= true), int_i=PostingsFormat(name=Memory doPackFST= true), plow_t=Lucene40(minBlockSize=70 maxBlockSize=156), id=Lucene40(minBlockSize=70 maxBlockSize=156), field_t=PostingsFormat(name=Memory doPackFST= true)}, sim=DefaultSimilarity, locale=ar_LY, timezone=Africa/Lagos
[junit4:junit4] 2> NOTE: Linux 3.2.0-26-generic amd64/Oracle Corporation 1.8.0-ea (64-bit)/cpus=8,threads=1,free=212900288,total=258605056
[junit4:junit4] 2> NOTE: All tests run in this JVM: [TestBadConfig, TestSearchPerf, TestHyphenationCompoundWordTokenFilterFactory, BinaryUpdateRequestHandlerTest, SolrIndexConfigTest, TestJmxIntegration, TestLFUCache, DistributedQueryElevationComponentTest]
[junit4:junit4] 2>
[junit4:junit4] Completed on J0 in 2.22s, 1 test, 1 failure <<< FAILURES!

[...truncated 862 lines...]
BUILD FAILED
/mnt/ssd/jenkins/workspace/Lucene-Solr-trunk-Linux-Java8-64/checkout/build.xml:29: The following error occurred while executing this line:
/mnt/ssd/jenkins/workspace/Lucene-Solr-trunk-Linux-Java8-64/checkout/solr/build.xml:144: The following error occurred while executing this line:
/mnt/ssd/jenkins/workspace/Lucene-Solr-trunk-Linux-Java8-64/checkout/lucene/module-build.xml:62: The following error occurred while executing this line:
/mnt/ssd/jenkins/workspace/Lucene-Solr-trunk-Linux-Java8-64/checkout/lucene/common-build.xml:1093: The following error occurred while executing this line:
/mnt/ssd/jenkins/workspace/Lucene-Solr-trunk-Linux-Java8-64/checkout/lucene/common-build.xml:788: There were test failures: 294 suites, 1050 tests, 1 failure, 5 ignored

Total time: 21 minutes 13 seconds
Build step 'Execute shell' marked build as failure
Archiving artifacts
Recording test results
Email was triggered for: Failure
Sending email for trigger: Failure

Lucene java-dev RSS feed   Index | Next | Previous | View Threaded
 
 


Interested in having your list archived? Contact Gossamer Threads
 
  Web Applications & Managed Hosting Powered by Gossamer Threads Inc.