Login | Register For Free | Help
Search for: (Advanced)

Mailing List Archive: Lucene: Java-Dev

[JENKINS] Lucene-Solr-tests-only-trunk - Build # 14800 - Failure

 

 

Lucene java-dev RSS feed   Index | Next | Previous | View Threaded


jenkins at builds

Jun 29, 2012, 2:45 PM

Post #1 of 1 (66 views)
Permalink
[JENKINS] Lucene-Solr-tests-only-trunk - Build # 14800 - Failure

Build: https://builds.apache.org/job/Lucene-Solr-tests-only-trunk/14800/

1 tests failed.
REGRESSION: org.apache.lucene.analysis.core.TestRandomChains.testRandomChains

Error Message:
startOffset must be non-negative, and endOffset must be >= startOffset, startOffset=3,endOffset=2

Stack Trace:
java.lang.IllegalArgumentException: startOffset must be non-negative, and endOffset must be >= startOffset, startOffset=3,endOffset=2
at __randomizedtesting.SeedInfo.seed([B2497B1B5B64D0D2:8FA8527A1C76CD12]:0)
at org.apache.lucene.analysis.tokenattributes.OffsetAttributeImpl.setOffset(OffsetAttributeImpl.java:51)
at org.apache.lucene.analysis.shingle.ShingleFilter.incrementToken(ShingleFilter.java:323)
at org.apache.lucene.analysis.ValidatingTokenFilter.incrementToken(ValidatingTokenFilter.java:78)
at org.apache.lucene.analysis.BaseTokenStreamTestCase.checkAnalysisConsistency(BaseTokenStreamTestCase.java:637)
at org.apache.lucene.analysis.BaseTokenStreamTestCase.checkRandomData(BaseTokenStreamTestCase.java:547)
at org.apache.lucene.analysis.BaseTokenStreamTestCase.checkRandomData(BaseTokenStreamTestCase.java:443)
at org.apache.lucene.analysis.core.TestRandomChains.testRandomChains(TestRandomChains.java:860)
at sun.reflect.NativeMethodAccessorImpl.invoke0(Native Method)
at sun.reflect.NativeMethodAccessorImpl.invoke(NativeMethodAccessorImpl.java:57)
at sun.reflect.DelegatingMethodAccessorImpl.invoke(DelegatingMethodAccessorImpl.java:43)
at java.lang.reflect.Method.invoke(Method.java:616)
at com.carrotsearch.randomizedtesting.RandomizedRunner.invoke(RandomizedRunner.java:1969)
at com.carrotsearch.randomizedtesting.RandomizedRunner.access$1100(RandomizedRunner.java:132)
at com.carrotsearch.randomizedtesting.RandomizedRunner$6.evaluate(RandomizedRunner.java:814)
at com.carrotsearch.randomizedtesting.RandomizedRunner$7.evaluate(RandomizedRunner.java:875)
at com.carrotsearch.randomizedtesting.RandomizedRunner$8.evaluate(RandomizedRunner.java:889)
at org.apache.lucene.util.TestRuleSetupTeardownChained$1.evaluate(TestRuleSetupTeardownChained.java:50)
at org.apache.lucene.util.TestRuleFieldCacheSanity$1.evaluate(TestRuleFieldCacheSanity.java:32)
at org.apache.lucene.util.AbstractBeforeAfterRule$1.evaluate(AbstractBeforeAfterRule.java:45)
at com.carrotsearch.randomizedtesting.rules.SystemPropertiesInvariantRule$1.evaluate(SystemPropertiesInvariantRule.java:55)
at org.apache.lucene.util.TestRuleReportUncaughtExceptions$1.evaluate(TestRuleReportUncaughtExceptions.java:68)
at org.apache.lucene.util.TestRuleThreadAndTestName$1.evaluate(TestRuleThreadAndTestName.java:48)
at org.apache.lucene.util.TestRuleIgnoreAfterMaxFailures$1.evaluate(TestRuleIgnoreAfterMaxFailures.java:70)
at org.apache.lucene.util.TestRuleMarkFailure$1.evaluate(TestRuleMarkFailure.java:48)
at com.carrotsearch.randomizedtesting.RandomizedRunner.runSingleTest(RandomizedRunner.java:821)
at com.carrotsearch.randomizedtesting.RandomizedRunner.access$700(RandomizedRunner.java:132)
at com.carrotsearch.randomizedtesting.RandomizedRunner$3$1.run(RandomizedRunner.java:669)
at com.carrotsearch.randomizedtesting.RandomizedRunner$3.evaluate(RandomizedRunner.java:695)
at com.carrotsearch.randomizedtesting.RandomizedRunner$4.evaluate(RandomizedRunner.java:734)
at com.carrotsearch.randomizedtesting.RandomizedRunner$5.evaluate(RandomizedRunner.java:745)
at org.apache.lucene.util.AbstractBeforeAfterRule$1.evaluate(AbstractBeforeAfterRule.java:45)
at org.apache.lucene.util.TestRuleReportUncaughtExceptions$1.evaluate(TestRuleReportUncaughtExceptions.java:68)
at org.apache.lucene.util.TestRuleStoreClassName$1.evaluate(TestRuleStoreClassName.java:38)
at org.apache.lucene.util.TestRuleIcuHack$1.evaluate(TestRuleIcuHack.java:51)
at com.carrotsearch.randomizedtesting.rules.SystemPropertiesInvariantRule$1.evaluate(SystemPropertiesInvariantRule.java:55)
at org.apache.lucene.util.TestRuleNoInstanceHooksOverrides$1.evaluate(TestRuleNoInstanceHooksOverrides.java:53)
at org.apache.lucene.util.TestRuleNoStaticHooksShadowing$1.evaluate(TestRuleNoStaticHooksShadowing.java:52)
at org.apache.lucene.util.TestRuleAssertionsRequired$1.evaluate(TestRuleAssertionsRequired.java:36)
at org.apache.lucene.util.TestRuleMarkFailure$1.evaluate(TestRuleMarkFailure.java:48)
at org.apache.lucene.util.TestRuleIgnoreAfterMaxFailures$1.evaluate(TestRuleIgnoreAfterMaxFailures.java:70)
at org.apache.lucene.util.TestRuleIgnoreTestSuites$1.evaluate(TestRuleIgnoreTestSuites.java:55)
at com.carrotsearch.randomizedtesting.RandomizedRunner.runSuite(RandomizedRunner.java:605)
at com.carrotsearch.randomizedtesting.RandomizedRunner.access$400(RandomizedRunner.java:132)
at com.carrotsearch.randomizedtesting.RandomizedRunner$2.run(RandomizedRunner.java:551)




Build Log:
[...truncated 4912 lines...]
[junit4] Completed on J0 in 0.01s, 2 tests
[junit4]
[junit4] Suite: org.apache.lucene.analysis.core.TestDuelingAnalyzers
[junit4] Completed on J0 in 23.33s, 6 tests
[junit4]
[junit4] Suite: org.apache.lucene.analysis.hi.TestHindiNormalizer
[junit4] Completed on J0 in 0.01s, 3 tests
[junit4]
[junit4] Suite: org.apache.lucene.analysis.fa.TestPersianNormalizationFilter
[junit4] Completed on J0 in 0.02s, 7 tests
[junit4]
[junit4] Suite: org.apache.lucene.analysis.snowball.TestSnowballVocab
[junit4] Completed on J0 in 3.08s, 1 test
[junit4]
[junit4] Suite: org.apache.lucene.analysis.core.TestStandardAnalyzer
[junit4] Completed on J0 in 18.34s, 31 tests
[junit4]
[junit4] Suite: org.apache.lucene.analysis.pt.TestPortugueseLightStemFilter
[junit4] Completed on J0 in 10.13s, 5 tests
[junit4]
[junit4] Suite: org.apache.lucene.analysis.fr.TestFrenchAnalyzer
[junit4] Completed on J0 in 8.91s, 7 tests
[junit4]
[junit4] Suite: org.apache.lucene.analysis.sv.TestSwedishLightStemFilter
[junit4] Completed on J0 in 10.78s, 3 tests
[junit4]
[junit4] Suite: org.apache.lucene.analysis.ca.TestCatalanAnalyzer
[junit4] Completed on J0 in 9.59s, 5 tests
[junit4]
[junit4] Suite: org.apache.lucene.analysis.synonym.TestWordnetSynonymParser
[junit4] Completed on J0 in 0.01s, 1 test
[junit4]
[junit4] Suite: org.apache.lucene.analysis.core.TestRandomChains
[junit4] ERROR 4.32s J0 | TestRandomChains.testRandomChains
[junit4] > Throwable #1: java.lang.IllegalArgumentException: startOffset must be non-negative, and endOffset must be >= startOffset, startOffset=3,endOffset=2
[junit4] > at __randomizedtesting.SeedInfo.seed([B2497B1B5B64D0D2:8FA8527A1C76CD12]:0)
[junit4] > at org.apache.lucene.analysis.tokenattributes.OffsetAttributeImpl.setOffset(OffsetAttributeImpl.java:51)
[junit4] > at org.apache.lucene.analysis.shingle.ShingleFilter.incrementToken(ShingleFilter.java:323)
[junit4] > at org.apache.lucene.analysis.ValidatingTokenFilter.incrementToken(ValidatingTokenFilter.java:78)
[junit4] > at org.apache.lucene.analysis.BaseTokenStreamTestCase.checkAnalysisConsistency(BaseTokenStreamTestCase.java:637)
[junit4] > at org.apache.lucene.analysis.BaseTokenStreamTestCase.checkRandomData(BaseTokenStreamTestCase.java:547)
[junit4] > at org.apache.lucene.analysis.BaseTokenStreamTestCase.checkRandomData(BaseTokenStreamTestCase.java:443)
[junit4] > at org.apache.lucene.analysis.core.TestRandomChains.testRandomChains(TestRandomChains.java:860)
[junit4] > at sun.reflect.NativeMethodAccessorImpl.invoke0(Native Method)
[junit4] > at sun.reflect.NativeMethodAccessorImpl.invoke(NativeMethodAccessorImpl.java:57)
[junit4] > at sun.reflect.DelegatingMethodAccessorImpl.invoke(DelegatingMethodAccessorImpl.java:43)
[junit4] > at java.lang.reflect.Method.invoke(Method.java:616)
[junit4] > at com.carrotsearch.randomizedtesting.RandomizedRunner.invoke(RandomizedRunner.java:1969)
[junit4] > at com.carrotsearch.randomizedtesting.RandomizedRunner.access$1100(RandomizedRunner.java:132)
[junit4] > at com.carrotsearch.randomizedtesting.RandomizedRunner$6.evaluate(RandomizedRunner.java:814)
[junit4] > at com.carrotsearch.randomizedtesting.RandomizedRunner$7.evaluate(RandomizedRunner.java:875)
[junit4] > at com.carrotsearch.randomizedtesting.RandomizedRunner$8.evaluate(RandomizedRunner.java:889)
[junit4] > at org.apache.lucene.util.TestRuleSetupTeardownChained$1.evaluate(TestRuleSetupTeardownChained.java:50)
[junit4] > at org.apache.lucene.util.TestRuleFieldCacheSanity$1.evaluate(TestRuleFieldCacheSanity.java:32)
[junit4] > at org.apache.lucene.util.AbstractBeforeAfterRule$1.evaluate(AbstractBeforeAfterRule.java:45)
[junit4] > at com.carrotsearch.randomizedtesting.rules.SystemPropertiesInvariantRule$1.evaluate(SystemPropertiesInvariantRule.java:55)
[junit4] > at org.apache.lucene.util.TestRuleReportUncaughtExceptions$1.evaluate(TestRuleReportUncaughtExceptions.java:68)
[junit4] > at org.apache.lucene.util.TestRuleThreadAndTestName$1.evaluate(TestRuleThreadAndTestName.java:48)
[junit4] > at org.apache.lucene.util.TestRuleIgnoreAfterMaxFailures$1.evaluate(TestRuleIgnoreAfterMaxFailures.java:70)
[junit4] > at org.apache.lucene.util.TestRuleMarkFailure$1.evaluate(TestRuleMarkFailure.java:48)
[junit4] > at com.carrotsearch.randomizedtesting.RandomizedRunner.runSingleTest(RandomizedRunner.java:821)
[junit4] > at com.carrotsearch.randomizedtesting.RandomizedRunner.access$700(RandomizedRunner.java:132)
[junit4] > at com.carrotsearch.randomizedtesting.RandomizedRunner$3$1.run(RandomizedRunner.java:669)
[junit4] > at com.carrotsearch.randomizedtesting.RandomizedRunner$3.evaluate(RandomizedRunner.java:695)
[junit4] > at com.carrotsearch.randomizedtesting.RandomizedRunner$4.evaluate(RandomizedRunner.java:734)
[junit4] > at com.carrotsearch.randomizedtesting.RandomizedRunner$5.evaluate(RandomizedRunner.java:745)
[junit4] > at org.apache.lucene.util.AbstractBeforeAfterRule$1.evaluate(AbstractBeforeAfterRule.java:45)
[junit4] > at org.apache.lucene.util.TestRuleReportUncaughtExceptions$1.evaluate(TestRuleReportUncaughtExceptions.java:68)
[junit4] > at org.apache.lucene.util.TestRuleStoreClassName$1.evaluate(TestRuleStoreClassName.java:38)
[junit4] > at org.apache.lucene.util.TestRuleIcuHack$1.evaluate(TestRuleIcuHack.java:51)
[junit4] > at com.carrotsearch.randomizedtesting.rules.SystemPropertiesInvariantRule$1.evaluate(SystemPropertiesInvariantRule.java:55)
[junit4] > at org.apache.lucene.util.TestRuleNoInstanceHooksOverrides$1.evaluate(TestRuleNoInstanceHooksOverrides.java:53)
[junit4] > at org.apache.lucene.util.TestRuleNoStaticHooksShadowing$1.evaluate(TestRuleNoStaticHooksShadowing.java:52)
[junit4] > at org.apache.lucene.util.TestRuleAssertionsRequired$1.evaluate(TestRuleAssertionsRequired.java:36)
[junit4] > at org.apache.lucene.util.TestRuleMarkFailure$1.evaluate(TestRuleMarkFailure.java:48)
[junit4] > at org.apache.lucene.util.TestRuleIgnoreAfterMaxFailures$1.evaluate(TestRuleIgnoreAfterMaxFailures.java:70)
[junit4] > at org.apache.lucene.util.TestRuleIgnoreTestSuites$1.evaluate(TestRuleIgnoreTestSuites.java:55)
[junit4] > at com.carrotsearch.randomizedtesting.RandomizedRunner.runSuite(RandomizedRunner.java:605)
[junit4] > at com.carrotsearch.randomizedtesting.RandomizedRunner.access$400(RandomizedRunner.java:132)
[junit4] > at com.carrotsearch.randomizedtesting.RandomizedRunner$2.run(RandomizedRunner.java:551)
[junit4] >
[junit4] 2> TEST FAIL: useCharFilter=false text='kiuig \u1e2ac\u0581 ubxb '
[junit4] 2> Exception from random analyzer:
[junit4] 2> charfilters=
[junit4] 2> org.apache.lucene.analysis.charfilter.MappingCharFilter(org.apache.lucene.analysis.charfilter.NormalizeCharMap [at] 2234fe9, org.apache.lucene.analysis.CharReader [at] 4534f32)
[junit4] 2> tokenizer=
[junit4] 2> org.apache.lucene.analysis.standard.ClassicTokenizer(LUCENE_50, org.apache.lucene.analysis.core.TestRandomChains$CheckThatYouDidntReadAnythingReaderWrapper [at] 174660a)
[junit4] 2> filters=
[junit4] 2> org.apache.lucene.analysis.compound.HyphenationCompoundWordTokenFilter(LUCENE_50, org.apache.lucene.analysis.ValidatingTokenFilter [at] 37c72, org.apache.lucene.analysis.compound.hyphenation.HyphenationTree [at] d7509c)
[junit4] 2> org.apache.lucene.analysis.el.GreekLowerCaseFilter(LUCENE_50, org.apache.lucene.analysis.ValidatingTokenFilter [at] 37c72)
[junit4] 2> org.apache.lucene.analysis.compound.HyphenationCompoundWordTokenFilter(LUCENE_50, org.apache.lucene.analysis.ValidatingTokenFilter [at] 37c72, org.apache.lucene.analysis.compound.hyphenation.HyphenationTree [at] 7ed5f55)
[junit4] 2> org.apache.lucene.analysis.shingle.ShingleFilter(org.apache.lucene.analysis.ValidatingTokenFilter [at] 6c11df, )
[junit4] 2> offsetsAreCorrect=false
[junit4] 2> NOTE: reproduce with: ant test -Dtestcase=TestRandomChains -Dtests.method=testRandomChains -Dtests.seed=B2497B1B5B64D0D2 -Dtests.multiplier=3 -Dtests.slow=true -Dtests.locale=iw -Dtests.timezone=Africa/Windhoek -Dargs="-Dfile.encoding=ISO8859-1"
[junit4] 2>
[junit4] > (@AfterClass output)
[junit4] 2> NOTE: test params are: codec=Lucene40: {dummy=MockVariableIntBlock(baseBlockSize=57)}, sim=RandomSimilarityProvider(queryNorm=true,coord=false): {}, locale=iw, timezone=Africa/Windhoek
[junit4] 2> NOTE: FreeBSD 9.0-RELEASE amd64/Sun Microsystems Inc. 1.6.0_32 (64-bit)/cpus=16,threads=1,free=84099192,total=217841664
[junit4] 2> NOTE: All tests run in this JVM: [.TokenOffsetPayloadTokenFilterTest, TestSpanishLightStemFilter, TestIndicNormalizer, EdgeNGramTokenFilterTest, TestPrefixAndSuffixAwareTokenFilter, TestHungarianLightStemFilter, TestTurkishAnalyzer, TestCzechStemmer, TestGalicianStemFilter, NumericPayloadTokenFilterTest, TestClassicAnalyzer, NGramTokenFilterTest, TestArabicAnalyzer, TestGermanLightStemFilter, TestEnglishMinimalStemFilter, GreekAnalyzerTest, TestGalicianAnalyzer, TestAnalyzers, TestDanishAnalyzer, TestPorterStemFilter, TestArabicNormalizationFilter, TestUAX29URLEmailTokenizer, TestBrazilianStemmer, TestPatternTokenizer, TestTeeSinkTokenFilter, TestEmptyTokenStream, EdgeNGramTokenizerTest, TestCompoundWordTokenFilter, TestPortugueseAnalyzer, TestSingleTokenTokenFilter, TestPersianAnalyzer, TestGermanStemFilter, TestKeywordMarkerFilter, TestDuelingAnalyzers, TestHindiNormalizer, TestPersianNormalizationFilter, TestSnowballVocab, TestStandardAnalyzer, TestPortugueseLightStemFilter, TestFrenchAnalyzer, TestSwedishLightStemFilter, TestCatalanAnalyzer, TestWordnetSynonymParser, TestRandomChains]
[junit4] 2>
[junit4] Completed on J0 in 4.57s, 1 test, 1 error <<< FAILURES!
[...truncated 185 lines...]

[...truncated 5198 lines...]

[...truncated 5198 lines...]

[...truncated 5198 lines...]

[...truncated 5198 lines...]

[...truncated 5198 lines...]

Lucene java-dev RSS feed   Index | Next | Previous | View Threaded
 
 


Interested in having your list archived? Contact Gossamer Threads
 
  Web Applications & Managed Hosting Powered by Gossamer Threads Inc.