Login | Register For Free | Help
Search for: (Advanced)

Mailing List Archive: Lucene: Java-Dev

[JENKINS] Lucene-Solr-trunk-Windows-Java7-64 - Build # 389 - Failure!

 

 

Lucene java-dev RSS feed   Index | Next | Previous | View Threaded


jenkins at sd-datasolutions

Jun 24, 2012, 9:52 AM

Post #1 of 1 (78 views)
Permalink
[JENKINS] Lucene-Solr-trunk-Windows-Java7-64 - Build # 389 - Failure!

Build: http://jenkins.sd-datasolutions.de/job/Lucene-Solr-trunk-Windows-Java7-64/389/

1 tests failed.
REGRESSION: org.apache.solr.spelling.suggest.SuggesterFSTTest.testReload

Error Message:
Exception during query

Stack Trace:
java.lang.RuntimeException: Exception during query
at __randomizedtesting.SeedInfo.seed([CAC2E0CFF6683C02:D3298CC3C2BC410]:0)
at org.apache.solr.SolrTestCaseJ4.assertQ(SolrTestCaseJ4.java:459)
at org.apache.solr.SolrTestCaseJ4.assertQ(SolrTestCaseJ4.java:426)
at org.apache.solr.spelling.suggest.SuggesterTest.testReload(SuggesterTest.java:91)
at sun.reflect.NativeMethodAccessorImpl.invoke0(Native Method)
at sun.reflect.NativeMethodAccessorImpl.invoke(NativeMethodAccessorImpl.java:57)
at sun.reflect.DelegatingMethodAccessorImpl.invoke(DelegatingMethodAccessorImpl.java:43)
at java.lang.reflect.Method.invoke(Method.java:601)
at com.carrotsearch.randomizedtesting.RandomizedRunner.invoke(RandomizedRunner.java:1969)
at com.carrotsearch.randomizedtesting.RandomizedRunner.access$1100(RandomizedRunner.java:132)
at com.carrotsearch.randomizedtesting.RandomizedRunner$6.evaluate(RandomizedRunner.java:814)
at com.carrotsearch.randomizedtesting.RandomizedRunner$7.evaluate(RandomizedRunner.java:875)
at com.carrotsearch.randomizedtesting.RandomizedRunner$8.evaluate(RandomizedRunner.java:889)
at com.carrotsearch.randomizedtesting.rules.SystemPropertiesRestoreRule$1.evaluate(SystemPropertiesRestoreRule.java:53)
at org.apache.lucene.util.TestRuleSetupTeardownChained$1.evaluate(TestRuleSetupTeardownChained.java:50)
at org.apache.lucene.util.TestRuleFieldCacheSanity$1.evaluate(TestRuleFieldCacheSanity.java:32)
at org.apache.lucene.util.AbstractBeforeAfterRule$1.evaluate(AbstractBeforeAfterRule.java:45)
at com.carrotsearch.randomizedtesting.rules.SystemPropertiesInvariantRule$1.evaluate(SystemPropertiesInvariantRule.java:55)
at org.apache.lucene.util.TestRuleReportUncaughtExceptions$1.evaluate(TestRuleReportUncaughtExceptions.java:68)
at org.apache.lucene.util.TestRuleThreadAndTestName$1.evaluate(TestRuleThreadAndTestName.java:48)
at org.apache.lucene.util.TestRuleMarkFailure$1.evaluate(TestRuleMarkFailure.java:48)
at com.carrotsearch.randomizedtesting.RandomizedRunner.runSingleTest(RandomizedRunner.java:821)
at com.carrotsearch.randomizedtesting.RandomizedRunner.access$700(RandomizedRunner.java:132)
at com.carrotsearch.randomizedtesting.RandomizedRunner$3$1.run(RandomizedRunner.java:669)
at com.carrotsearch.randomizedtesting.RandomizedRunner$3.evaluate(RandomizedRunner.java:695)
at com.carrotsearch.randomizedtesting.RandomizedRunner$4.evaluate(RandomizedRunner.java:734)
at com.carrotsearch.randomizedtesting.RandomizedRunner$5.evaluate(RandomizedRunner.java:745)
at com.carrotsearch.randomizedtesting.rules.SystemPropertiesRestoreRule$1.evaluate(SystemPropertiesRestoreRule.java:53)
at org.apache.lucene.util.AbstractBeforeAfterRule$1.evaluate(AbstractBeforeAfterRule.java:45)
at org.apache.lucene.util.TestRuleReportUncaughtExceptions$1.evaluate(TestRuleReportUncaughtExceptions.java:68)
at org.apache.lucene.util.TestRuleStoreClassName$1.evaluate(TestRuleStoreClassName.java:38)
at org.apache.lucene.util.TestRuleIcuHack$1.evaluate(TestRuleIcuHack.java:51)
at com.carrotsearch.randomizedtesting.rules.SystemPropertiesInvariantRule$1.evaluate(SystemPropertiesInvariantRule.java:55)
at org.apache.lucene.util.TestRuleNoInstanceHooksOverrides$1.evaluate(TestRuleNoInstanceHooksOverrides.java:53)
at org.apache.lucene.util.TestRuleNoStaticHooksShadowing$1.evaluate(TestRuleNoStaticHooksShadowing.java:52)
at org.apache.lucene.util.TestRuleAssertionsRequired$1.evaluate(TestRuleAssertionsRequired.java:36)
at org.apache.lucene.util.TestRuleMarkFailure$1.evaluate(TestRuleMarkFailure.java:48)
at org.apache.lucene.util.TestRuleIgnoreTestSuites$1.evaluate(TestRuleIgnoreTestSuites.java:56)
at com.carrotsearch.randomizedtesting.RandomizedRunner.runSuite(RandomizedRunner.java:605)
at com.carrotsearch.randomizedtesting.RandomizedRunner.access$400(RandomizedRunner.java:132)
at com.carrotsearch.randomizedtesting.RandomizedRunner$2.run(RandomizedRunner.java:551)
Caused by: java.lang.NullPointerException
at org.apache.lucene.search.suggest.fst.FSTCompletionLookup.lookup(FSTCompletionLookup.java:239)
at org.apache.solr.spelling.suggest.Suggester.getSuggestions(Suggester.java:188)
at org.apache.solr.handler.component.SpellCheckComponent.process(SpellCheckComponent.java:172)
at org.apache.solr.handler.component.SearchHandler.handleRequestBody(SearchHandler.java:204)
at org.apache.solr.handler.RequestHandlerBase.handleRequest(RequestHandlerBase.java:129)
at org.apache.solr.core.SolrCore.execute(SolrCore.java:1561)
at org.apache.solr.util.TestHarness.query(TestHarness.java:357)
at org.apache.solr.util.TestHarness.query(TestHarness.java:340)
at org.apache.solr.SolrTestCaseJ4.assertQ(SolrTestCaseJ4.java:433)
... 39 more




Build Log:
[...truncated 7831 lines...]
[junit4] Suite: org.apache.solr.spelling.suggest.SuggesterFSTTest
[junit4] > (@BeforeClass output)
[junit4] 2> 1 T1042 oas.SolrTestCaseJ4.initCore ####initCore
[junit4] 2> Creating dataDir: C:\Jenkins\workspace\Lucene-Solr-trunk-Windows-Java7-64\solr\build\solr-core\test\J0\.\solrtest-SuggesterFSTTest-1340556026621
[junit4] 2> 1 T1042 oasc.SolrResourceLoader.locateSolrHome JNDI not configured for solr (NoInitialContextEx)
[junit4] 2> 1 T1042 oasc.SolrResourceLoader.locateSolrHome using system property solr.solr.home: C:\Jenkins\workspace\Lucene-Solr-trunk-Windows-Java7-64\solr\build\solr-core\test-files\solr
[junit4] 2> 2 T1042 oasc.SolrResourceLoader.<init> new SolrResourceLoader for deduced Solr Home: 'C:\Jenkins\workspace\Lucene-Solr-trunk-Windows-Java7-64\solr\build\solr-core\test-files\solr\'
[junit4] 2> 2 T1042 oasc.SolrResourceLoader.replaceClassLoader Adding 'file:/C:/Jenkins/workspace/Lucene-Solr-trunk-Windows-Java7-64/solr/build/solr-core/test-files/solr/lib/classes/' to classloader
[junit4] 2> 2 T1042 oasc.SolrResourceLoader.replaceClassLoader Adding 'file:/C:/Jenkins/workspace/Lucene-Solr-trunk-Windows-Java7-64/solr/build/solr-core/test-files/solr/lib/README' to classloader
[junit4] 2> 34 T1042 oasc.SolrConfig.<init> Using Lucene MatchVersion: LUCENE_50
[junit4] 2> 95 T1042 oasc.SolrConfig.<init> Loaded SolrConfig: solrconfig-spellchecker.xml
[junit4] 2> 669 T1042 oass.IndexSchema.readSchema Reading Solr Schema
[junit4] 2> 672 T1042 oass.IndexSchema.readSchema Schema name=Solr SpellCheck Test
[junit4] 2> 789 T1042 oass.IndexSchema.readSchema default search field in schema is text
[junit4] 2> 791 T1042 oass.IndexSchema.readSchema query parser default operator is OR
[junit4] 2> 793 T1042 oass.IndexSchema.readSchema unique key field: id
[junit4] 2> 796 T1042 oasc.SolrResourceLoader.locateSolrHome JNDI not configured for solr (NoInitialContextEx)
[junit4] 2> 796 T1042 oasc.SolrResourceLoader.locateSolrHome using system property solr.solr.home: C:\Jenkins\workspace\Lucene-Solr-trunk-Windows-Java7-64\solr\build\solr-core\test-files\solr
[junit4] 2> 796 T1042 oasc.SolrResourceLoader.<init> new SolrResourceLoader for directory: 'C:\Jenkins\workspace\Lucene-Solr-trunk-Windows-Java7-64\solr\build\solr-core\test-files\solr\'
[junit4] 2> 796 T1042 oasc.SolrResourceLoader.replaceClassLoader Adding 'file:/C:/Jenkins/workspace/Lucene-Solr-trunk-Windows-Java7-64/solr/build/solr-core/test-files/solr/lib/classes/' to classloader
[junit4] 2> 796 T1042 oasc.SolrResourceLoader.replaceClassLoader Adding 'file:/C:/Jenkins/workspace/Lucene-Solr-trunk-Windows-Java7-64/solr/build/solr-core/test-files/solr/lib/README' to classloader
[junit4] 2> 796 T1042 oasc.CoreContainer.<init> New CoreContainer 86303114
[junit4] 2> 797 T1042 oasc.SolrCore.<init> [collection1] Opening new SolrCore at C:\Jenkins\workspace\Lucene-Solr-trunk-Windows-Java7-64\solr\build\solr-core\test-files\solr\, dataDir=C:\Jenkins\workspace\Lucene-Solr-trunk-Windows-Java7-64\solr\build\solr-core\test\J0\.\solrtest-SuggesterFSTTest-1340556026621\
[junit4] 2> 797 T1042 oasc.SolrCore.<init> JMX monitoring not detected for core: collection1
[junit4] 2> 797 T1042 oasc.SolrCore.getNewIndexDir WARNING New index directory detected: old=null new=C:\Jenkins\workspace\Lucene-Solr-trunk-Windows-Java7-64\solr\build\solr-core\test\J0\.\solrtest-SuggesterFSTTest-1340556026621\index/
[junit4] 2> 798 T1042 oasc.SolrCore.initIndex WARNING [collection1] Solr index directory 'C:\Jenkins\workspace\Lucene-Solr-trunk-Windows-Java7-64\solr\build\solr-core\test\J0\.\solrtest-SuggesterFSTTest-1340556026621\index' doesn't exist. Creating new index...
[junit4] 2> 968 T1042 oasc.SolrDeletionPolicy.onCommit SolrDeletionPolicy.onCommit: commits:num=1
[junit4] 2> commit{dir=MockDirWrapper(org.apache.lucene.store.MMapDirectory@C:\Jenkins\workspace\Lucene-Solr-trunk-Windows-Java7-64\solr\build\solr-core\test\J0\solrtest-SuggesterFSTTest-1340556026621\index lockFactory=org.apache.lucene.store.NativeFSLockFactory [at] 5cdacf2),segFN=segments_1,generation=1,filenames=[segments_1]
[junit4] 2> 969 T1042 oasc.SolrDeletionPolicy.updateCommits newest commit = 1
[junit4] 2> 970 T1042 oasc.RequestHandlers.initHandlersFromConfig created standard: solr.StandardRequestHandler
[junit4] 2> 970 T1042 oasc.RequestHandlers.initHandlersFromConfig created /suggest: org.apache.solr.handler.component.SearchHandler
[junit4] 2> 970 T1042 oasc.RequestHandlers.initHandlersFromConfig created /suggest_tst: org.apache.solr.handler.component.SearchHandler
[junit4] 2> 970 T1042 oasc.RequestHandlers.initHandlersFromConfig created /suggest_fst: org.apache.solr.handler.component.SearchHandler
[junit4] 2> 971 T1042 oasc.RequestHandlers.initHandlersFromConfig created /suggest_wfst: org.apache.solr.handler.component.SearchHandler
[junit4] 2> 1043 T1042 oass.SolrIndexSearcher.<init> Opening Searcher [at] 4abc628 main
[junit4] 2> 1043 T1042 oass.SolrIndexSearcher.<init> WARNING WARNING: Directory impl does not support setting indexDir: org.apache.lucene.store.MockDirectoryWrapper
[junit4] 2> 1044 T1042 oasu.CommitTracker.<init> Hard AutoCommit: disabled
[junit4] 2> 1044 T1042 oasu.CommitTracker.<init> Soft AutoCommit: disabled
[junit4] 2> 1044 T1042 oashc.SpellCheckComponent.inform Initializing spell checkers
[junit4] 2> 1044 T1042 oasss.Suggester.init init: {name=suggest,classname=org.apache.solr.spelling.suggest.Suggester,lookupImpl=org.apache.solr.spelling.suggest.jaspell.JaspellLookup,field=suggest,storeDir=suggest,buildOnCommit=true,threshold=0.0}
[junit4] 2> 1045 T1042 oasssj.JaspellLookupFactory.create init: {name=suggest,classname=org.apache.solr.spelling.suggest.Suggester,lookupImpl=org.apache.solr.spelling.suggest.jaspell.JaspellLookup,field=suggest,storeDir=suggest,buildOnCommit=true,threshold=0.0}
[junit4] 2> 1045 T1042 oashc.SpellCheckComponent.inform Registering newSearcher listener for spellchecker: suggest
[junit4] 2> 1045 T1042 oashc.SpellCheckComponent.inform No queryConverter defined, using default converter
[junit4] 2> 1045 T1042 oashc.SpellCheckComponent.inform Initializing spell checkers
[junit4] 2> 1045 T1042 oasss.Suggester.init init: {name=suggest_tst,classname=org.apache.solr.spelling.suggest.Suggester,lookupImpl=org.apache.solr.spelling.suggest.tst.TSTLookup,field=suggest,storeDir=suggest_tst,buildOnCommit=true,threshold=0.0}
[junit4] 2> 1046 T1042 oashc.SpellCheckComponent.inform Registering newSearcher listener for spellchecker: suggest_tst
[junit4] 2> 1046 T1042 oashc.SpellCheckComponent.inform No queryConverter defined, using default converter
[junit4] 2> 1046 T1042 oashc.SpellCheckComponent.inform Initializing spell checkers
[junit4] 2> 1047 T1042 oasss.Suggester.init init: {name=suggest_fst,classname=org.apache.solr.spelling.suggest.Suggester,lookupImpl=org.apache.solr.spelling.suggest.fst.FSTLookup,field=suggest,storeDir=suggest_fst,buildOnCommit=true,weightBuckets=5,exactMatchFirst=true}
[junit4] 2> 1081 T1042 oashc.SpellCheckComponent.inform Registering newSearcher listener for spellchecker: suggest_fst
[junit4] 2> 1081 T1042 oashc.SpellCheckComponent.inform No queryConverter defined, using default converter
[junit4] 2> 1082 T1042 oashc.SpellCheckComponent.inform Initializing spell checkers
[junit4] 2> 1082 T1042 oasss.Suggester.init init: {name=suggest_wfst,classname=org.apache.solr.spelling.suggest.Suggester,lookupImpl=org.apache.solr.spelling.suggest.fst.WFSTLookupFactory,field=suggest,storeDir=suggest_wfst,buildOnCommit=true,exactMatchFirst=true}
[junit4] 2> 1082 T1042 oashc.SpellCheckComponent.inform Registering newSearcher listener for spellchecker: suggest_wfst
[junit4] 2> 1083 T1042 oashc.SpellCheckComponent.inform No queryConverter defined, using default converter
[junit4] 2> 1083 T1042 oashc.HttpShardHandlerFactory.getParameter Setting socketTimeout to: 0
[junit4] 2> 1083 T1042 oashc.HttpShardHandlerFactory.getParameter Setting urlScheme to: http://
[junit4] 2> 1083 T1042 oashc.HttpShardHandlerFactory.getParameter Setting connTimeout to: 0
[junit4] 2> 1083 T1042 oashc.HttpShardHandlerFactory.getParameter Setting maxConnectionsPerHost to: 20
[junit4] 2> 1083 T1042 oashc.HttpShardHandlerFactory.getParameter Setting corePoolSize to: 0
[junit4] 2> 1083 T1042 oashc.HttpShardHandlerFactory.getParameter Setting maximumPoolSize to: 2147483647
[junit4] 2> 1084 T1042 oashc.HttpShardHandlerFactory.getParameter Setting maxThreadIdleTime to: 5
[junit4] 2> 1084 T1042 oashc.HttpShardHandlerFactory.getParameter Setting sizeOfQueue to: -1
[junit4] 2> 1084 T1042 oashc.HttpShardHandlerFactory.getParameter Setting fairnessPolicy to: false
[junit4] 2> 1084 T1042 oascsi.HttpClientUtil.createClient Creating new http client, config:maxConnectionsPerHost=20&maxConnections=10000&socketTimeout=0&connTimeout=0&retry=false
[junit4] 2> 1089 T1042 oasc.CoreContainer.register registering core: collection1
[junit4] 2> 1090 T1042 oas.SolrTestCaseJ4.initCore ####initCore end
[junit4] 2>
[junit4] ERROR 3.15s | SuggesterFSTTest.testReload
[junit4] > Throwable #1: java.lang.RuntimeException: Exception during query
[junit4] > at __randomizedtesting.SeedInfo.seed([CAC2E0CFF6683C02:D3298CC3C2BC410]:0)
[junit4] > at org.apache.solr.SolrTestCaseJ4.assertQ(SolrTestCaseJ4.java:459)
[junit4] > at org.apache.solr.SolrTestCaseJ4.assertQ(SolrTestCaseJ4.java:426)
[junit4] > at org.apache.solr.spelling.suggest.SuggesterTest.testReload(SuggesterTest.java:91)
[junit4] > at sun.reflect.NativeMethodAccessorImpl.invoke0(Native Method)
[junit4] > at sun.reflect.NativeMethodAccessorImpl.invoke(NativeMethodAccessorImpl.java:57)
[junit4] > at sun.reflect.DelegatingMethodAccessorImpl.invoke(DelegatingMethodAccessorImpl.java:43)
[junit4] > at java.lang.reflect.Method.invoke(Method.java:601)
[junit4] > at com.carrotsearch.randomizedtesting.RandomizedRunner.invoke(RandomizedRunner.java:1969)
[junit4] > at com.carrotsearch.randomizedtesting.RandomizedRunner.access$1100(RandomizedRunner.java:132)
[junit4] > at com.carrotsearch.randomizedtesting.RandomizedRunner$6.evaluate(RandomizedRunner.java:814)
[junit4] > at com.carrotsearch.randomizedtesting.RandomizedRunner$7.evaluate(RandomizedRunner.java:875)
[junit4] > at com.carrotsearch.randomizedtesting.RandomizedRunner$8.evaluate(RandomizedRunner.java:889)
[junit4] > at com.carrotsearch.randomizedtesting.rules.SystemPropertiesRestoreRule$1.evaluate(SystemPropertiesRestoreRule.java:53)
[junit4] > at org.apache.lucene.util.TestRuleSetupTeardownChained$1.evaluate(TestRuleSetupTeardownChained.java:50)
[junit4] > at org.apache.lucene.util.TestRuleFieldCacheSanity$1.evaluate(TestRuleFieldCacheSanity.java:32)
[junit4] > at org.apache.lucene.util.AbstractBeforeAfterRule$1.evaluate(AbstractBeforeAfterRule.java:45)
[junit4] > at com.carrotsearch.randomizedtesting.rules.SystemPropertiesInvariantRule$1.evaluate(SystemPropertiesInvariantRule.java:55)
[junit4] > at org.apache.lucene.util.TestRuleReportUncaughtExceptions$1.evaluate(TestRuleReportUncaughtExceptions.java:68)
[junit4] > at org.apache.lucene.util.TestRuleThreadAndTestName$1.evaluate(TestRuleThreadAndTestName.java:48)
[junit4] > at org.apache.lucene.util.TestRuleMarkFailure$1.evaluate(TestRuleMarkFailure.java:48)
[junit4] > at com.carrotsearch.randomizedtesting.RandomizedRunner.runSingleTest(RandomizedRunner.java:821)
[junit4] > at com.carrotsearch.randomizedtesting.RandomizedRunner.access$700(RandomizedRunner.java:132)
[junit4] > at com.carrotsearch.randomizedtesting.RandomizedRunner$3$1.run(RandomizedRunner.java:669)
[junit4] > at com.carrotsearch.randomizedtesting.RandomizedRunner$3.evaluate(RandomizedRunner.java:695)
[junit4] > at com.carrotsearch.randomizedtesting.RandomizedRunner$4.evaluate(RandomizedRunner.java:734)
[junit4] > at com.carrotsearch.randomizedtesting.RandomizedRunner$5.evaluate(RandomizedRunner.java:745)
[junit4] > at com.carrotsearch.randomizedtesting.rules.SystemPropertiesRestoreRule$1.evaluate(SystemPropertiesRestoreRule.java:53)
[junit4] > at org.apache.lucene.util.AbstractBeforeAfterRule$1.evaluate(AbstractBeforeAfterRule.java:45)
[junit4] > at org.apache.lucene.util.TestRuleReportUncaughtExceptions$1.evaluate(TestRuleReportUncaughtExceptions.java:68)
[junit4] > at org.apache.lucene.util.TestRuleStoreClassName$1.evaluate(TestRuleStoreClassName.java:38)
[junit4] > at org.apache.lucene.util.TestRuleIcuHack$1.evaluate(TestRuleIcuHack.java:51)
[junit4] > at com.carrotsearch.randomizedtesting.rules.SystemPropertiesInvariantRule$1.evaluate(SystemPropertiesInvariantRule.java:55)
[junit4] > at org.apache.lucene.util.TestRuleNoInstanceHooksOverrides$1.evaluate(TestRuleNoInstanceHooksOverrides.java:53)
[junit4] > at org.apache.lucene.util.TestRuleNoStaticHooksShadowing$1.evaluate(TestRuleNoStaticHooksShadowing.java:52)
[junit4] > at org.apache.lucene.util.TestRuleAssertionsRequired$1.evaluate(TestRuleAssertionsRequired.java:36)
[junit4] > at org.apache.lucene.util.TestRuleMarkFailure$1.evaluate(TestRuleMarkFailure.java:48)
[junit4] > at org.apache.lucene.util.TestRuleIgnoreTestSuites$1.evaluate(TestRuleIgnoreTestSuites.java:56)
[junit4] > at com.carrotsearch.randomizedtesting.RandomizedRunner.runSuite(RandomizedRunner.java:605)
[junit4] > at com.carrotsearch.randomizedtesting.RandomizedRunner.access$400(RandomizedRunner.java:132)
[junit4] > at com.carrotsearch.randomizedtesting.RandomizedRunner$2.run(RandomizedRunner.java:551)
[junit4] > Caused by: java.lang.NullPointerException
[junit4] > at org.apache.lucene.search.suggest.fst.FSTCompletionLookup.lookup(FSTCompletionLookup.java:239)
[junit4] > at org.apache.solr.spelling.suggest.Suggester.getSuggestions(Suggester.java:188)
[junit4] > at org.apache.solr.handler.component.SpellCheckComponent.process(SpellCheckComponent.java:172)
[junit4] > at org.apache.solr.handler.component.SearchHandler.handleRequestBody(SearchHandler.java:204)
[junit4] > at org.apache.solr.handler.RequestHandlerBase.handleRequest(RequestHandlerBase.java:129)
[junit4] > at org.apache.solr.core.SolrCore.execute(SolrCore.java:1561)
[junit4] > at org.apache.solr.util.TestHarness.query(TestHarness.java:357)
[junit4] > at org.apache.solr.util.TestHarness.query(TestHarness.java:340)
[junit4] > at org.apache.solr.SolrTestCaseJ4.assertQ(SolrTestCaseJ4.java:433)
[junit4] > ... 39 more
[junit4] >
[junit4] 2> 1091 T1042 oas.SolrTestCaseJ4.setUp ###Starting testReload
[junit4] 2> ASYNC NEW_CORE C62 name=collection1 org.apache.solr.core.SolrCore [at] 663bf7e
[junit4] 2> 1132 T1042 C62 oasc.SolrDeletionPolicy.onInit SolrDeletionPolicy.onInit: commits:num=1
[junit4] 2> commit{dir=MockDirWrapper(org.apache.lucene.store.MMapDirectory@C:\Jenkins\workspace\Lucene-Solr-trunk-Windows-Java7-64\solr\build\solr-core\test\J0\solrtest-SuggesterFSTTest-1340556026621\index lockFactory=org.apache.lucene.store.NativeFSLockFactory [at] 5cdacf2),segFN=segments_1,generation=1,filenames=[segments_1]
[junit4] 2> 1133 T1042 C62 oasc.SolrDeletionPolicy.updateCommits newest commit = 1
[junit4] 2> 1201 T1042 C62 UPDATE [collection1] webapp=null path=null params={} {add=[1]} 0 105
[junit4] 2> 1213 T1042 C62 UPDATE [collection1] webapp=null path=null params={} {add=[2]} 0 0
[junit4] 2> 1223 T1042 C62 UPDATE [collection1] webapp=null path=null params={} {add=[3]} 0 1
[junit4] 2> 1263 T1042 C62 oasu.DirectUpdateHandler2.commit start commit{flags=0,version=0,optimize=false,openSearcher=true,waitSearcher=true,expungeDeletes=false,softCommit=false}
[junit4] 2> 1844 T1042 C62 oasc.SolrDeletionPolicy.onCommit SolrDeletionPolicy.onCommit: commits:num=2
[junit4] 2> commit{dir=MockDirWrapper(org.apache.lucene.store.MMapDirectory@C:\Jenkins\workspace\Lucene-Solr-trunk-Windows-Java7-64\solr\build\solr-core\test\J0\solrtest-SuggesterFSTTest-1340556026621\index lockFactory=org.apache.lucene.store.NativeFSLockFactory [at] 5cdacf2),segFN=segments_1,generation=1,filenames=[segments_1]
[junit4] 2> commit{dir=MockDirWrapper(org.apache.lucene.store.MMapDirectory@C:\Jenkins\workspace\Lucene-Solr-trunk-Windows-Java7-64\solr\build\solr-core\test\J0\solrtest-SuggesterFSTTest-1340556026621\index lockFactory=org.apache.lucene.store.NativeFSLockFactory [at] 5cdacf2),segFN=segments_2,generation=2,filenames=[._0_Lucene40_0.tim, _0.fnm, _0_Lucene40_0.frq, _0_nrm.cfe, segments_2, _0.fdx, _0_nrm.cfs, _0.si, _0_Lucene40_0.prx, _0.fdt, _0_Lucene40_0.tip]
[junit4] 2> 1844 T1042 C62 oasc.SolrDeletionPolicy.updateCommits newest commit = 2
[junit4] 2> 1844 T1042 C62 oasc.SolrCore.getSearcher WARNING [collection1] PERFORMANCE WARNING: Overlapping onDeckSearchers=2
[junit4] 2> 2472 T1042 C62 oass.SolrIndexSearcher.<init> Opening Searcher [at] 66a34c3 main
[junit4] 2> 2473 T1042 C62 oass.SolrIndexSearcher.<init> WARNING WARNING: Directory impl does not support setting indexDir: org.apache.lucene.store.MockDirectoryWrapper
[junit4] 2> 2473 T1042 C62 oasu.DirectUpdateHandler2.commit end_commit_flush
[junit4] 2> 2474 T1043 oasc.SolrCore.registerSearcher [collection1] Registered new searcher Searcher [at] 4abc628 main{StandardDirectoryReader(segments_1:1)}
[junit4] 2> 2475 T1043 oashc.SpellCheckComponent$SpellCheckerListener.newSearcher Loading spell index for spellchecker: suggest
[junit4] 2> 2475 T1043 oasss.Suggester.reload reload()
[junit4] 2> 2476 T1043 oashc.SpellCheckComponent$SpellCheckerListener.newSearcher SEVERE Exception in reloading spell check index for spellchecker: suggest java.io.FileNotFoundException: C:\Jenkins\workspace\Lucene-Solr-trunk-Windows-Java7-64\solr\build\solr-core\test\J0\.\solrtest-SuggesterFSTTest-1340556026621\suggest\jaspell.dat (The system cannot find the file specified)
[junit4] 2> at java.io.FileInputStream.open(Native Method)
[junit4] 2> at java.io.FileInputStream.<init>(FileInputStream.java:138)
[junit4] 2> at org.apache.solr.spelling.suggest.Suggester.reload(Suggester.java:164)
[junit4] 2> at org.apache.solr.handler.component.SpellCheckComponent$SpellCheckerListener.newSearcher(SpellCheckComponent.java:673)
[junit4] 2> at org.apache.solr.core.SolrCore$3.call(SolrCore.java:1341)
[junit4] 2> at java.util.concurrent.FutureTask$Sync.innerRun(FutureTask.java:334)
[junit4] 2> at java.util.concurrent.FutureTask.run(FutureTask.java:166)
[junit4] 2> at java.util.concurrent.ThreadPoolExecutor.runWorker(ThreadPoolExecutor.java:1110)
[junit4] 2> at java.util.concurrent.ThreadPoolExecutor$Worker.run(ThreadPoolExecutor.java:603)
[junit4] 2> at java.lang.Thread.run(Thread.java:722)
[junit4] 2>
[junit4] 2> 2478 T1043 oashc.SpellCheckComponent$SpellCheckerListener.newSearcher Loading spell index for spellchecker: suggest_tst
[junit4] 2> 2478 T1043 oasss.Suggester.reload reload()
[junit4] 2> 2478 T1043 oashc.SpellCheckComponent$SpellCheckerListener.newSearcher SEVERE Exception in reloading spell check index for spellchecker: suggest_tst java.io.FileNotFoundException: C:\Jenkins\workspace\Lucene-Solr-trunk-Windows-Java7-64\solr\build\solr-core\test\J0\.\solrtest-SuggesterFSTTest-1340556026621\suggest_tst\tst.dat (The system cannot find the file specified)
[junit4] 2> at java.io.FileInputStream.open(Native Method)
[junit4] 2> at java.io.FileInputStream.<init>(FileInputStream.java:138)
[junit4] 2> at org.apache.solr.spelling.suggest.Suggester.reload(Suggester.java:164)
[junit4] 2> at org.apache.solr.handler.component.SpellCheckComponent$SpellCheckerListener.newSearcher(SpellCheckComponent.java:673)
[junit4] 2> at org.apache.solr.core.SolrCore$3.call(SolrCore.java:1341)
[junit4] 2> at java.util.concurrent.FutureTask$Sync.innerRun(FutureTask.java:334)
[junit4] 2> at java.util.concurrent.FutureTask.run(FutureTask.java:166)
[junit4] 2> at java.util.concurrent.ThreadPoolExecutor.runWorker(ThreadPoolExecutor.java:1110)
[junit4] 2> at java.util.concurrent.ThreadPoolExecutor$Worker.run(ThreadPoolExecutor.java:603)
[junit4] 2> at java.lang.Thread.run(Thread.java:722)
[junit4] 2>
[junit4] 2> 2478 T1043 oashc.SpellCheckComponent$SpellCheckerListener.newSearcher Loading spell index for spellchecker: suggest_fst
[junit4] 2> 2478 T1043 oasss.Suggester.reload reload()
[junit4] 2> 2479 T1043 oashc.SpellCheckComponent$SpellCheckerListener.newSearcher SEVERE Exception in reloading spell check index for spellchecker: suggest_fst java.io.FileNotFoundException: C:\Jenkins\workspace\Lucene-Solr-trunk-Windows-Java7-64\solr\build\solr-core\test\J0\.\solrtest-SuggesterFSTTest-1340556026621\suggest_fst\fst.bin (The system cannot find the file specified)
[junit4] 2> at java.io.FileInputStream.open(Native Method)
[junit4] 2> at java.io.FileInputStream.<init>(FileInputStream.java:138)
[junit4] 2> at org.apache.solr.spelling.suggest.Suggester.reload(Suggester.java:164)
[junit4] 2> at org.apache.solr.handler.component.SpellCheckComponent$SpellCheckerListener.newSearcher(SpellCheckComponent.java:673)
[junit4] 2> at org.apache.solr.core.SolrCore$3.call(SolrCore.java:1341)
[junit4] 2> at java.util.concurrent.FutureTask$Sync.innerRun(FutureTask.java:334)
[junit4] 2> at java.util.concurrent.FutureTask.run(FutureTask.java:166)
[junit4] 2> at java.util.concurrent.ThreadPoolExecutor.runWorker(ThreadPoolExecutor.java:1110)
[junit4] 2> at java.util.concurrent.ThreadPoolExecutor$Worker.run(ThreadPoolExecutor.java:603)
[junit4] 2> at java.lang.Thread.run(Thread.java:722)
[junit4] 2>
[junit4] 2> 2479 T1043 oashc.SpellCheckComponent$SpellCheckerListener.newSearcher Loading spell index for spellchecker: suggest_wfst
[junit4] 2> 2480 T1043 oasss.Suggester.reload reload()
[junit4] 2> 2480 T1043 oashc.SpellCheckComponent$SpellCheckerListener.newSearcher SEVERE Exception in reloading spell check index for spellchecker: suggest_wfst java.io.FileNotFoundException: C:\Jenkins\workspace\Lucene-Solr-trunk-Windows-Java7-64\solr\build\solr-core\test\J0\.\solrtest-SuggesterFSTTest-1340556026621\suggest_wfst\wfst.bin (The system cannot find the file specified)
[junit4] 2> at java.io.FileInputStream.open(Native Method)
[junit4] 2> at java.io.FileInputStream.<init>(FileInputStream.java:138)
[junit4] 2> at org.apache.solr.spelling.suggest.Suggester.reload(Suggester.java:164)
[junit4] 2> at org.apache.solr.handler.component.SpellCheckComponent$SpellCheckerListener.newSearcher(SpellCheckComponent.java:673)
[junit4] 2> at org.apache.solr.core.SolrCore$3.call(SolrCore.java:1341)
[junit4] 2> at java.util.concurrent.FutureTask$Sync.innerRun(FutureTask.java:334)
[junit4] 2> at java.util.concurrent.FutureTask.run(FutureTask.java:166)
[junit4] 2> at java.util.concurrent.ThreadPoolExecutor.runWorker(ThreadPoolExecutor.java:1110)
[junit4] 2> at java.util.concurrent.ThreadPoolExecutor$Worker.run(ThreadPoolExecutor.java:603)
[junit4] 2> at java.lang.Thread.run(Thread.java:722)
[junit4] 2>
[junit4] 2> 2507 T1043 oasc.SolrCore.registerSearcher [collection1] Registered new searcher Searcher [at] 66a34c3 main{StandardDirectoryReader(segments_2:3 _0(5.0):C3)}
[junit4] 2> 2509 T1042 C62 UPDATE [collection1] webapp=null path=null params={} {commit=} 0 1246
[junit4] 2> 2509 T1042 oas.SolrTestCaseJ4.deleteCore ###deleteCore
[junit4] 2> 2509 T1042 oasc.CoreContainer.shutdown Shutting down CoreContainer instance=86303114
[junit4] 2> 2509 T1042 oasc.SolrCore.close [collection1] CLOSING SolrCore org.apache.solr.core.SolrCore [at] 663bf7e
[junit4] 2> 2519 T1042 oasc.SolrCore.closeSearcher [collection1] Closing main searcher on request.
[junit4] 2> 2519 T1042 oasu.DirectUpdateHandler2.close closing DirectUpdateHandler2{commits=1,autocommits=0,soft autocommits=0,optimizes=0,rollbacks=0,expungeDeletes=0,docsPending=0,adds=0,deletesById=0,deletesByQuery=0,errors=0,cumulative_adds=3,cumulative_deletesById=0,cumulative_deletesByQuery=0,cumulative_errors=0}
[junit4] 2> NOTE: per solr.test.leavedatadir, dataDir will not be removed: C:\Jenkins\workspace\Lucene-Solr-trunk-Windows-Java7-64\solr\build\solr-core\test\J0\.\solrtest-SuggesterFSTTest-1340556026621
[junit4] 2> 2519 T1042 oas.SolrTestCaseJ4.initCore ####initCore
[junit4] 2> 2519 T1042 oasc.SolrResourceLoader.locateSolrHome JNDI not configured for solr (NoInitialContextEx)
[junit4] 2> 2519 T1042 oasc.SolrResourceLoader.locateSolrHome using system property solr.solr.home: C:\Jenkins\workspace\Lucene-Solr-trunk-Windows-Java7-64\solr\build\solr-core\test-files\solr
[junit4] 2> 2519 T1042 oasc.SolrResourceLoader.<init> new SolrResourceLoader for deduced Solr Home: 'C:\Jenkins\workspace\Lucene-Solr-trunk-Windows-Java7-64\solr\build\solr-core\test-files\solr\'
[junit4] 2> 2519 T1042 oasc.SolrResourceLoader.replaceClassLoader Adding 'file:/C:/Jenkins/workspace/Lucene-Solr-trunk-Windows-Java7-64/solr/build/solr-core/test-files/solr/lib/classes/' to classloader
[junit4] 2> 2519 T1042 oasc.SolrResourceLoader.replaceClassLoader Adding 'file:/C:/Jenkins/workspace/Lucene-Solr-trunk-Windows-Java7-64/solr/build/solr-core/test-files/solr/lib/README' to classloader
[junit4] 2> 2603 T1042 oasc.SolrConfig.<init> Using Lucene MatchVersion: LUCENE_50
[junit4] 2> 2703 T1042 oasc.SolrConfig.<init> Loaded SolrConfig: solrconfig-spellchecker.xml
[junit4] 2> 2703 T1042 oass.IndexSchema.readSchema Reading Solr Schema
[junit4] 2> 2712 T1042 oass.IndexSchema.readSchema Schema name=test
[junit4] 2> 3859 T1042 oass.OpenExchangeRatesOrgProvider.init Initialized with rates=open-exchange-rates.json, refreshInterval=1440.
[junit4] 2> 3872 T1042 oass.IndexSchema.readSchema default search field in schema is text
[junit4] 2> 3885 T1042 oass.IndexSchema.readSchema unique key field: id
[junit4] 2> 3922 T1042 oass.FileExchangeRateProvider.reload Reloading exchange rates from file currency.xml
[junit4] 2> 3933 T1042 oass.FileExchangeRateProvider.reload Reloading exchange rates from file currency.xml
[junit4] 2> 3944 T1042 oass.OpenExchangeRatesOrgProvider.reload Reloading exchange rates from open-exchange-rates.json
[junit4] 2> 3945 T1042 oass.OpenExchangeRatesOrgProvider.reload Reloading exchange rates from open-exchange-rates.json
[junit4] 2> 3945 T1042 oasc.SolrResourceLoader.locateSolrHome JNDI not configured for solr (NoInitialContextEx)
[junit4] 2> 3945 T1042 oasc.SolrResourceLoader.locateSolrHome using system property solr.solr.home: C:\Jenkins\workspace\Lucene-Solr-trunk-Windows-Java7-64\solr\build\solr-core\test-files\solr
[junit4] 2> 3946 T1042 oasc.SolrResourceLoader.<init> new SolrResourceLoader for directory: 'C:\Jenkins\workspace\Lucene-Solr-trunk-Windows-Java7-64\solr\build\solr-core\test-files\solr\'
[junit4] 2> 3946 T1042 oasc.SolrResourceLoader.replaceClassLoader Adding 'file:/C:/Jenkins/workspace/Lucene-Solr-trunk-Windows-Java7-64/solr/build/solr-core/test-files/solr/lib/classes/' to classloader
[junit4] 2> 3946 T1042 oasc.SolrResourceLoader.replaceClassLoader Adding 'file:/C:/Jenkins/workspace/Lucene-Solr-trunk-Windows-Java7-64/solr/build/solr-core/test-files/solr/lib/README' to classloader
[junit4] 2> 3947 T1042 oasc.CoreContainer.<init> New CoreContainer 2061154675
[junit4] 2> 3948 T1042 oasc.SolrCore.<init> [collection1] Opening new SolrCore at C:\Jenkins\workspace\Lucene-Solr-trunk-Windows-Java7-64\solr\build\solr-core\test-files\solr\, dataDir=C:\Jenkins\workspace\Lucene-Solr-trunk-Windows-Java7-64\solr\build\solr-core\test\J0\.\solrtest-SuggesterFSTTest-1340556026621\
[junit4] 2> 3948 T1042 oasc.SolrCore.<init> JMX monitoring not detected for core: collection1
[junit4] 2> 3949 T1042 oasc.SolrCore.getNewIndexDir WARNING New index directory detected: old=null new=C:\Jenkins\workspace\Lucene-Solr-trunk-Windows-Java7-64\solr\build\solr-core\test\J0\.\solrtest-SuggesterFSTTest-1340556026621\index/
[junit4] 2> 4030 T1042 oasc.RequestHandlers.initHandlersFromConfig created standard: solr.StandardRequestHandler
[junit4] 2> 4031 T1042 oasc.RequestHandlers.initHandlersFromConfig created /suggest: org.apache.solr.handler.component.SearchHandler
[junit4] 2> 4031 T1042 oasc.RequestHandlers.initHandlersFromConfig created /suggest_tst: org.apache.solr.handler.component.SearchHandler
[junit4] 2> 4032 T1042 oasc.RequestHandlers.initHandlersFromConfig created /suggest_fst: org.apache.solr.handler.component.SearchHandler
[junit4] 2> 4032 T1042 oasc.RequestHandlers.initHandlersFromConfig created /suggest_wfst: org.apache.solr.handler.component.SearchHandler
[junit4] 2> 4186 T1042 oass.SolrIndexSearcher.<init> Opening Searcher [at] 1b51c6c main
[junit4] 2> 4186 T1042 oass.SolrIndexSearcher.<init> WARNING WARNING: Directory impl does not support setting indexDir: org.apache.lucene.store.MockDirectoryWrapper
[junit4] 2> 4188 T1042 oasu.CommitTracker.<init> Hard AutoCommit: disabled
[junit4] 2> 4189 T1042 oasu.CommitTracker.<init> Soft AutoCommit: disabled
[junit4] 2> 4190 T1042 oashc.SpellCheckComponent.inform Initializing spell checkers
[junit4] 2> 4193 T1042 oasss.Suggester.init init: {name=suggest,classname=org.apache.solr.spelling.suggest.Suggester,lookupImpl=org.apache.solr.spelling.suggest.jaspell.JaspellLookup,field=suggest,storeDir=suggest,buildOnCommit=true,threshold=0.0}
[junit4] 2> 4194 T1042 oasssj.JaspellLookupFactory.create init: {name=suggest,classname=org.apache.solr.spelling.suggest.Suggester,lookupImpl=org.apache.solr.spelling.suggest.jaspell.JaspellLookup,field=suggest,storeDir=suggest,buildOnCommit=true,threshold=0.0}
[junit4] 2> 4195 T1042 oasss.Suggester.init WARNING Loading stored lookup data failed java.io.FileNotFoundException: C:\Jenkins\workspace\Lucene-Solr-trunk-Windows-Java7-64\solr\build\solr-core\test\J0\.\solrtest-SuggesterFSTTest-1340556026621\suggest\jaspell.dat (The system cannot find the file specified)
[junit4] 2> at java.io.FileInputStream.open(Native Method)
[junit4] 2> at java.io.FileInputStream.<init>(FileInputStream.java:138)
[junit4] 2> at org.apache.solr.spelling.suggest.Suggester.init(Suggester.java:114)
[junit4] 2> at org.apache.solr.handler.component.SpellCheckComponent.inform(SpellCheckComponent.java:596)
[junit4] 2> at org.apache.solr.core.SolrResourceLoader.inform(SolrResourceLoader.java:560)
[junit4] 2> at org.apache.solr.core.SolrCore.<init>(SolrCore.java:615)
[junit4] 2> at org.apache.solr.core.SolrCore.<init>(SolrCore.java:504)
[junit4] 2> at org.apache.solr.util.TestHarness$Initializer.initialize(TestHarness.java:220)
[junit4] 2> at org.apache.solr.util.TestHarness.<init>(TestHarness.java:141)
[junit4] 2> at org.apache.solr.util.TestHarness.<init>(TestHarness.java:136)
[junit4] 2> at org.apache.solr.util.TestHarness.<init>(TestHarness.java:126)
[junit4] 2> at org.apache.solr.SolrTestCaseJ4.createCore(SolrTestCaseJ4.java:328)
[junit4] 2> at org.apache.solr.SolrTestCaseJ4.initCore(SolrTestCaseJ4.java:321)
[junit4] 2> at org.apache.solr.spelling.suggest.SuggesterTest.testReload(SuggesterTest.java:90)
[junit4] 2> at sun.reflect.NativeMethodAccessorImpl.invoke0(Native Method)
[junit4] 2> at sun.reflect.NativeMethodAccessorImpl.invoke(NativeMethodAccessorImpl.java:57)
[junit4] 2> at sun.reflect.DelegatingMethodAccessorImpl.invoke(DelegatingMethodAccessorImpl.java:43)
[junit4] 2> at java.lang.reflect.Method.invoke(Method.java:601)
[junit4] 2> at com.carrotsearch.randomizedtesting.RandomizedRunner.invoke(RandomizedRunner.java:1969)
[junit4] 2> at com.carrotsearch.randomizedtesting.RandomizedRunner.access$1100(RandomizedRunner.java:132)
[junit4] 2> at com.carrotsearch.randomizedtesting.RandomizedRunner$6.evaluate(RandomizedRunner.java:814)
[junit4] 2> at com.carrotsearch.randomizedtesting.RandomizedRunner$7.evaluate(RandomizedRunner.java:875)
[junit4] 2> at com.carrotsearch.randomizedtesting.RandomizedRunner$8.evaluate(RandomizedRunner.java:889)
[junit4] 2> at com.carrotsearch.randomizedtesting.rules.SystemPropertiesRestoreRule$1.evaluate(SystemPropertiesRestoreRule.java:53)
[junit4] 2> at org.apache.lucene.util.TestRuleSetupTeardownChained$1.evaluate(TestRuleSetupTeardownChained.java:50)
[junit4] 2> at org.apache.lucene.util.TestRuleFieldCacheSanity$1.evaluate(TestRuleFieldCacheSanity.java:32)
[junit4] 2> at org.apache.lucene.util.AbstractBeforeAfterRule$1.evaluate(AbstractBeforeAfterRule.java:45)
[junit4] 2> at com.carrotsearch.randomizedtesting.rules.SystemPropertiesInvariantRule$1.evaluate(SystemPropertiesInvariantRule.java:55)
[junit4] 2> at org.apache.lucene.util.TestRuleReportUncaughtExceptions$1.evaluate(TestRuleReportUncaughtExceptions.java:68)
[junit4] 2> at org.apache.lucene.util.TestRuleThreadAndTestName$1.evaluate(TestRuleThreadAndTestName.java:48)
[junit4] 2> at org.apache.lucene.util.TestRuleMarkFailure$1.evaluate(TestRuleMarkFailure.java:48)
[junit4] 2> at com.carrotsearch.randomizedtesting.RandomizedRunner.runSingleTest(RandomizedRunner.java:821)
[junit4] 2> at com.carrotsearch.randomizedtesting.RandomizedRunner.access$700(RandomizedRunner.java:132)
[junit4] 2> at com.carrotsearch.randomizedtesting.RandomizedRunner$3$1.run(RandomizedRunner.java:669)
[junit4] 2> at com.carrotsearch.randomizedtesting.RandomizedRunner$3.evaluate(RandomizedRunner.java:695)
[junit4] 2> at com.carrotsearch.randomizedtesting.RandomizedRunner$4.evaluate(RandomizedRunner.java:734)
[junit4] 2> at com.carrotsearch.randomizedtesting.RandomizedRunner$5.evaluate(RandomizedRunner.java:745)
[junit4] 2> at com.carrotsearch.randomizedtesting.rules.SystemPropertiesRestoreRule$1.evaluate(SystemPropertiesRestoreRule.java:53)
[junit4] 2> at org.apache.lucene.util.AbstractBeforeAfterRule$1.evaluate(AbstractBeforeAfterRule.java:45)
[junit4] 2> at org.apache.lucene.util.TestRuleReportUncaughtExceptions$1.evaluate(TestRuleReportUncaughtExceptions.java:68)
[junit4] 2> at org.apache.lucene.util.TestRuleStoreClassName$1.evaluate(TestRuleStoreClassName.java:38)
[junit4] 2> at org.apache.lucene.util.TestRuleIcuHack$1.evaluate(TestRuleIcuHack.java:51)
[junit4] 2> at com.carrotsearch.randomizedtesting.rules.SystemPropertiesInvariantRule$1.evaluate(SystemPropertiesInvariantRule.java:55)
[junit4] 2> at org.apache.lucene.util.TestRuleNoInstanceHooksOverrides$1.evaluate(TestRuleNoInstanceHooksOverrides.java:53)
[junit4] 2> at org.apache.lucene.util.TestRuleNoStaticHooksShadowing$1.evaluate(TestRuleNoStaticHooksShadowing.java:52)
[junit4] 2> at org.apache.lucene.util.TestRuleAssertionsRequired$1.evaluate(TestRuleAssertionsRequired.java:36)
[junit4] 2> at org.apache.lucene.util.TestRuleMarkFailure$1.evaluate(TestRuleMarkFailure.java:48)
[junit4] 2> at org.apache.lucene.util.TestRuleIgnoreTestSuites$1.evaluate(TestRuleIgnoreTestSuites.java:56)
[junit4] 2> at com.carrotsearch.randomizedtesting.RandomizedRunner.runSuite(RandomizedRunner.java:605)
[junit4] 2> at com.carrotsearch.randomizedtesting.RandomizedRunner.access$400(RandomizedRunner.java:132)
[junit4] 2> at com.carrotsearch.randomizedtesting.RandomizedRunner$2.run(RandomizedRunner.java:551)
[junit4] 2>
[junit4] 2> 4196 T1042 oashc.SpellCheckComponent.inform Registering newSearcher listener for spellchecker: suggest
[junit4] 2> 4197 T1042 oashc.SpellCheckComponent.inform No queryConverter defined, using default converter
[junit4] 2> 4197 T1042 oashc.SpellCheckComponent.inform Initializing spell checkers
[junit4] 2> 4198 T1042 oasss.Suggester.init init: {name=suggest_tst,classname=org.apache.solr.spelling.suggest.Suggester,lookupImpl=org.apache.solr.spelling.suggest.tst.TSTLookup,field=suggest,storeDir=suggest_tst,buildOnCommit=true,threshold=0.0}
[junit4] 2> 4198 T1042 oasss.Suggester.init WARNING Loading stored lookup data failed java.io.FileNotFoundException: C:\Jenkins\workspace\Lucene-Solr-trunk-Windows-Java7-64\solr\build\solr-core\test\J0\.\solrtest-SuggesterFSTTest-1340556026621\suggest_tst\tst.dat (The system cannot find the file specified)
[junit4] 2> at java.io.FileInputStream.open(Native Method)
[junit4] 2> at java.io.FileInputStream.<init>(FileInputStream.java:138)
[junit4] 2> at org.apache.solr.spelling.suggest.Suggester.init(Suggester.java:114)
[junit4] 2> at org.apache.solr.handler.component.SpellCheckComponent.inform(SpellCheckComponent.java:596)
[junit4] 2> at org.apache.solr.core.SolrResourceLoader.inform(SolrResourceLoader.java:560)
[junit4] 2> at org.apache.solr.core.SolrCore.<init>(SolrCore.java:615)
[junit4] 2> at org.apache.solr.core.SolrCore.<init>(SolrCore.java:504)
[junit4] 2> at org.apache.solr.util.TestHarness$Initializer.initialize(TestHarness.java:220)
[junit4] 2> at org.apache.solr.util.TestHarness.<init>(TestHarness.java:141)
[junit4] 2> at org.apache.solr.util.TestHarness.<init>(TestHarness.java:136)
[junit4] 2> at org.apache.solr.util.TestHarness.<init>(TestHarness.java:126)
[junit4] 2> at org.apache.solr.SolrTestCaseJ4.createCore(SolrTestCaseJ4.java:328)
[junit4] 2> at org.apache.solr.SolrTestCaseJ4.initCore(SolrTestCaseJ4.java:321)
[junit4] 2> at org.apache.solr.spelling.suggest.SuggesterTest.testReload(SuggesterTest.java:90)
[junit4] 2> at sun.reflect.NativeMethodAccessorImpl.invoke0(Native Method)
[junit4] 2> at sun.reflect.NativeMethodAccessorImpl.invoke(NativeMethodAccessorImpl.java:57)
[junit4] 2> at sun.reflect.DelegatingMethodAccessorImpl.invoke(DelegatingMethodAccessorImpl.java:43)
[junit4] 2> at java.lang.reflect.Method.invoke(Method.java:601)
[junit4] 2> at com.carrotsearch.randomizedtesting.RandomizedRunner.invoke(RandomizedRunner.java:1969)
[junit4] 2> at com.carrotsearch.randomizedtesting.RandomizedRunner.access$1100(RandomizedRunner.java:132)
[junit4] 2> at com.carrotsearch.randomizedtesting.RandomizedRunner$6.evaluate(RandomizedRunner.java:814)
[junit4] 2> at com.carrotsearch.randomizedtesting.RandomizedRunner$7.evaluate(RandomizedRunner.java:875)
[junit4] 2> at com.carrotsearch.randomizedtesting.RandomizedRunner$8.evaluate(RandomizedRunner.java:889)
[junit4] 2> at com.carrotsearch.randomizedtesting.rules.SystemPropertiesRestoreRule$1.evaluate(SystemPropertiesRestoreRule.java:53)
[junit4] 2> at org.apache.lucene.util.TestRuleSetupTeardownChained$1.evaluate(TestRuleSetupTeardownChained.java:50)
[junit4] 2> at org.apache.lucene.util.TestRuleFieldCacheSanity$1.evaluate(TestRuleFieldCacheSanity.java:32)
[junit4] 2> at org.apache.lucene.util.AbstractBeforeAfterRule$1.evaluate(AbstractBeforeAfterRule.java:45)
[junit4] 2> at com.carrotsearch.randomizedtesting.rules.SystemPropertiesInvariantRule$1.evaluate(SystemPropertiesInvariantRule.java:55)
[junit4] 2> at org.apache.lucene.util.TestRuleReportUncaughtExceptions$1.evaluate(TestRuleReportUncaughtExceptions.java:68)
[junit4] 2> at org.apache.lucene.util.TestRuleThreadAndTestName$1.evaluate(TestRuleThreadAndTestName.java:48)
[junit4] 2> at org.apache.lucene.util.TestRuleMarkFailure$1.evaluate(TestRuleMarkFailure.java:48)
[junit4] 2> at com.carrotsearch.randomizedtesting.RandomizedRunner.runSingleTest(RandomizedRunner.java:821)
[junit4] 2> at com.carrotsearch.randomizedtesting.RandomizedRunner.access$700(RandomizedRunner.java:132)
[junit4] 2> at com.carrotsearch.randomizedtesting.RandomizedRunner$3$1.run(RandomizedRunner.java:669)
[junit4] 2> at com.carrotsearch.randomizedtesting.RandomizedRunner$3.evaluate(RandomizedRunner.java:695)
[junit4] 2> at com.carrotsearch.randomizedtesting.RandomizedRunner$4.evaluate(RandomizedRunner.java:734)
[junit4] 2> at com.carrotsearch.randomizedtesting.RandomizedRunner$5.evaluate(RandomizedRunner.java:745)
[junit4] 2> at com.carrotsearch.randomizedtesting.rules.SystemPropertiesRestoreRule$1.evaluate(SystemPropertiesRestoreRule.java:53)
[junit4] 2> at org.apache.lucene.util.AbstractBeforeAfterRule$1.evaluate(AbstractBeforeAfterRule.java:45)
[junit4] 2> at org.apache.lucene.util.TestRuleReportUncaughtExceptions$1.evaluate(TestRuleReportUncaughtExceptions.java:68)
[junit4] 2> at org.apache.lucene.util.TestRuleStoreClassName$1.evaluate(TestRuleStoreClassName.java:38)
[junit4] 2> at org.apache.lucene.util.TestRuleIcuHack$1.evaluate(TestRuleIcuHack.java:51)
[junit4] 2> at com.carrotsearch.randomizedtesting.rules.SystemPropertiesInvariantRule$1.evaluate(SystemPropertiesInvariantRule.java:55)
[junit4] 2> at org.apache.lucene.util.TestRuleNoInstanceHooksOverrides$1.evaluate(TestRuleNoInstanceHooksOverrides.java:53)
[junit4] 2> at org.apache.lucene.util.TestRuleNoStaticHooksShadowing$1.evaluate(TestRuleNoStaticHooksShadowing.java:52)
[junit4] 2> at org.apache.lucene.util.TestRuleAssertionsRequired$1.evaluate(TestRuleAssertionsRequired.java:36)
[junit4] 2> at org.apache.lucene.util.TestRuleMarkFailure$1.evaluate(TestRuleMarkFailure.java:48)
[junit4] 2> at org.apache.lucene.util.TestRuleIgnoreTestSuites$1.evaluate(TestRuleIgnoreTestSuites.java:56)
[junit4] 2> at com.carrotsearch.randomizedtesting.RandomizedRunner.runSuite(RandomizedRunner.java:605)
[junit4] 2> at com.carrotsearch.randomizedtesting.RandomizedRunner.access$400(RandomizedRunner.java:132)
[junit4] 2> at com.carrotsearch.randomizedtesting.RandomizedRunner$2.run(RandomizedRunner.java:551)
[junit4] 2>
[junit4] 2> 4199 T1042 oashc.SpellCheckComponent.inform Registering newSearcher listener for spellchecker: suggest_tst
[junit4] 2> 4199 T1042 oashc.SpellCheckComponent.inform No queryConverter defined, using default converter
[junit4] 2> 4200 T1042 oashc.SpellCheckComponent.inform Initializing spell checkers
[junit4] 2> 4200 T1042 oasss.Suggester.init init: {name=suggest_fst,classname=org.apache.solr.spelling.suggest.Suggester,lookupImpl=org.apache.solr.spelling.suggest.fst.FSTLookup,field=suggest,storeDir=suggest_fst,buildOnCommit=true,weightBuckets=5,exactMatchFirst=true}
[junit4] 2> 4201 T1042 oasss.Suggester.init WARNING Loading stored lookup data failed java.io.FileNotFoundException: C:\Jenkins\workspace\Lucene-Solr-trunk-Windows-Java7-64\solr\build\solr-core\test\J0\.\solrtest-SuggesterFSTTest-1340556026621\suggest_fst\fst.bin (The system cannot find the file specified)
[junit4] 2> at java.io.FileInputStream.open(Native Method)
[junit4] 2> at java.io.FileInputStream.<init>(FileInputStream.java:138)
[junit4] 2> at org.apache.solr.spelling.suggest.Suggester.init(Suggester.java:114)
[junit4] 2> at org.apache.solr.handler.component.SpellCheckComponent.inform(SpellCheckComponent.java:596)
[junit4] 2> at org.apache.solr.core.SolrResourceLoader.inform(SolrResourceLoader.java:560)
[junit4] 2> at org.apache.solr.core.SolrCore.<init>(SolrCore.java:615)
[junit4] 2> at org.apache.solr.core.SolrCore.<init>(SolrCore.java:504)
[junit4] 2> at org.apache.solr.util.TestHarness$Initializer.initialize(TestHarness.java:220)
[junit4] 2> at org.apache.solr.util.TestHarness.<init>(TestHarness.java:141)
[junit4] 2> at org.apache.solr.util.TestHarness.<init>(TestHarness.java:136)
[junit4] 2> at org.apache.solr.util.TestHarness.<init>(TestHarness.java:126)
[junit4] 2> at org.apache.solr.SolrTestCaseJ4.createCore(SolrTestCaseJ4.java:328)
[junit4] 2> at org.apache.solr.SolrTestCaseJ4.initCore(SolrTestCaseJ4.java:321)
[junit4] 2> at org.apache.solr.spelling.suggest.SuggesterTest.testReload(SuggesterTest.java:90)
[junit4] 2> at sun.reflect.NativeMethodAccessorImpl.invoke0(Native Method)
[junit4] 2> at sun.reflect.NativeMethodAccessorImpl.invoke(NativeMethodAccessorImpl.java:57)
[junit4] 2> at sun.reflect.DelegatingMethodAccessorImpl.invoke(DelegatingMethodAccessorImpl.java:43)
[junit4] 2> at java.lang.reflect.Method.invoke(Method.java:601)
[junit4] 2> at com.carrotsearch.randomizedtesting.RandomizedRunner.invoke(RandomizedRunner.java:1969)
[junit4] 2> at com.carrotsearch.randomizedtesting.RandomizedRunner.access$1100(RandomizedRunner.java:132)
[junit4] 2> at com.carrotsearch.randomizedtesting.RandomizedRunner$6.evaluate(RandomizedRunner.java:814)
[junit4] 2> at com.carrotsearch.randomizedtesting.RandomizedRunner$7.evaluate(RandomizedRunner.java:875)
[junit4] 2> at com.carrotsearch.randomizedtesting.RandomizedRunner$8.evaluate(RandomizedRunner.java:889)
[junit4] 2> at com.carrotsearch.randomizedtesting.rules.SystemPropertiesRestoreRule$1.evaluate(SystemPropertiesRestoreRule.java:53)
[junit4] 2> at org.apache.lucene.util.TestRuleSetupTeardownChained$1.evaluate(TestRuleSetupTeardownChained.java:50)
[junit4] 2> at org.apache.lucene.util.TestRuleFieldCacheSanity$1.evaluate(TestRuleFieldCacheSanity.java:32)
[junit4] 2> at org.apache.lucene.util.AbstractBeforeAfterRule$1.evaluate(AbstractBeforeAfterRule.java:45)
[junit4] 2> at com.carrotsearch.randomizedtesting.rules.SystemPropertiesInvariantRule$1.evaluate(SystemPropertiesInvariantRule.java:55)
[junit4] 2> at org.apache.lucene.util.TestRuleReportUncaughtExceptions$1.evaluate(TestRuleReportUncaughtExceptions.java:68)
[junit4] 2> at org.apache.lucene.util.TestRuleThreadAndTestName$1.evaluate(TestRuleThreadAndTestName.java:48)
[junit4] 2> at org.apache.lucene.util.TestRuleMarkFailure$1.evaluate(TestRuleMarkFailure.java:48)
[junit4] 2> at com.carrotsearch.randomizedtesting.RandomizedRunner.runSingleTest(RandomizedRunner.java:821)
[junit4] 2> at com.carrotsearch.randomizedtesting.RandomizedRunner.access$700(RandomizedRunner.java:132)
[junit4] 2> at com.carrotsearch.randomizedtesting.RandomizedRunner$3$1.run(RandomizedRunner.java:669)
[junit4] 2> at com.carrotsearch.randomizedtesting.RandomizedRunner$3.evaluate(RandomizedRunner.java:695)
[junit4] 2> at com.carrotsearch.randomizedtesting.RandomizedRunner$4.evaluate(RandomizedRunner.java:734)
[junit4] 2> at com.carrotsearch.randomizedtesting.RandomizedRunner$5.evaluate(RandomizedRunner.java:745)
[junit4] 2> at com.carrotsearch.randomizedtesting.rules.SystemPropertiesRestoreRule$1.evaluate(SystemPropertiesRestoreRule.java:53)
[junit4] 2> at org.apache.lucene.util.AbstractBeforeAfterRule$1.evaluate(AbstractBeforeAfterRule.java:45)
[junit4] 2> at org.apache.lucene.util.TestRuleReportUncaughtExceptions$1.evaluate(TestRuleReportUncaughtExceptions.java:68)
[junit4] 2> at org.apache.lucene.util.TestRuleStoreClassName$1.evaluate(TestRuleStoreClassName.java:38)
[junit4] 2> at org.apache.lucene.util.TestRuleIcuHack$1.evaluate(TestRuleIcuHack.java:51)
[junit4] 2> at com.carrotsearch.randomizedtesting.rules.SystemPropertiesInvariantRule$1.evaluate(SystemPropertiesInvariantRule.java:55)
[junit4] 2> at org.apache.lucene.util.TestRuleNoInstanceHooksOverrides$1.evaluate(TestRuleNoInstanceHooksOverrides.java:53)
[junit4] 2> at org.apache.lucene.util.TestRuleNoStaticHooksShadowing$1.evaluate(TestRuleNoStaticHooksShadowing.java:52)
[junit4] 2> at org.apache.lucene.util.TestRuleAssertionsRequired$1.evaluate(TestRuleAssertionsRequired.java:36)
[junit4] 2> at org.apache.lucene.util.TestRuleMarkFailure$1.evaluate(TestRuleMarkFailure.java:48)
[junit4] 2> at org.apache.lucene.util.TestRuleIgnoreTestSuites$1.evaluate(TestRuleIgnoreTestSuites.java:56)
[junit4] 2> at com.carrotsearch.randomizedtesting.RandomizedRunner.runSuite(RandomizedRunner.java:605)
[junit4] 2> at com.carrotsearch.randomizedtesting.RandomizedRunner.access$400(RandomizedRunner.java:132)
[junit4] 2> at com.carrotsearch.randomizedtesting.RandomizedRunner$2.run(RandomizedRunner.java:551)
[junit4] 2>
[junit4] 2> 4203 T1042 oashc.SpellCheckComponent.inform Registering newSearcher listener for spellchecker: suggest_fst
[junit4] 2> 4203 T1042 oashc.SpellCheckComponent.inform No queryConverter defined, using default converter
[junit4] 2> 4203 T1042 oashc.SpellCheckComponent.inform Initializing spell checkers
[junit4] 2> 4203 T1042 oasss.Suggester.init init: {name=suggest_wfst,classname=org.apache.solr.spelling.suggest.Suggester,lookupImpl=org.apache.solr.spelling.suggest.fst.WFSTLookupFactory,field=suggest,storeDir=suggest_wfst,buildOnCommit=true,exactMatchFirst=true}
[junit4] 2> 4204 T1042 oasss.Suggester.init WARNING Loading stored lookup data failed java.io.FileNotFoundException: C:\Jenkins\workspace\Lucene-Solr-trunk-Windows-Java7-64\solr\build\solr-core\test\J0\.\solrtest-SuggesterFSTTest-1340556026621\suggest_wfst\wfst.bin (The system cannot find the file specified)
[junit4] 2> at java.io.FileInputStream.open(Native Method)
[junit4] 2> at java.io.FileInputStream.<init>(FileInputStream.java:138)
[junit4] 2> at org.apache.solr.spelling.suggest.Suggester.init(Suggester.java:114)
[junit4] 2> at org.apache.solr.handler.component.SpellCheckComponent.inform(SpellCheckComponent.java:596)
[junit4] 2> at org.apache.solr.core.SolrResourceLoader.inform(SolrResourceLoader.java:560)
[junit4] 2> at org.apache.solr.core.SolrCore.<init>(SolrCore.java:615)
[junit4] 2> at org.apache.solr.core.SolrCore.<init>(SolrCore.java:504)
[junit4] 2> at org.apache.solr.util.TestHarness$Initializer.initialize(TestHarness.java:220)
[junit4] 2> at org.apache.solr.util.TestHarness.<init>(TestHarness.java:141)
[junit4] 2> at org.apache.solr.util.TestHarness.<init>(TestHarness.java:136)
[junit4] 2> at org.apache.solr.util.TestHarness.<init>(TestHarness.java:126)
[junit4] 2> at org.apache.solr.SolrTestCaseJ4.createCore(SolrTestCaseJ4.java:328)
[junit4] 2> at org.apache.solr.SolrTestCaseJ4.initCore(SolrTestCaseJ4.java:321)
[junit4] 2> at org.apache.solr.spelling.suggest.SuggesterTest.testReload(SuggesterTest.java:90)
[junit4] 2> at sun.reflect.NativeMethodAccessorImpl.invoke0(Native Method)
[junit4] 2> at sun.reflect.NativeMethodAccessorImpl.invoke(NativeMethodAccessorImpl.java:57)
[junit4] 2> at sun.reflect.DelegatingMethodAccessorImpl.invoke(DelegatingMethodAccessorImpl.java:43)
[junit4] 2> at java.lang.reflect.Method.invoke(Method.java:601)
[junit4] 2> at com.carrotsearch.randomizedtesting.RandomizedRunner.invoke(RandomizedRunner.java:1969)
[junit4] 2> at com.carrotsearch.randomizedtesting.RandomizedRunner.access$1100(RandomizedRunner.java:132)
[junit4] 2> at com.carrotsearch.randomizedtesting.RandomizedRunner$6.evaluate(RandomizedRunner.java:814)
[junit4] 2> at com.carrotsearch.randomizedtesting.RandomizedRunner$7.evaluate(RandomizedRunner.java:875)
[junit4] 2> at com.carrotsearch.randomizedtesting.RandomizedRunner$8.evaluate(RandomizedRunner.java:889)
[junit4] 2> at com.carrotsearch.randomizedtesting.rules.SystemPropertiesRestoreRule$1.evaluate(SystemPropertiesRestoreRule.java:53)
[junit4] 2> at org.apache.lucene.util.TestRuleSetupTeardownChained$1.evaluate(TestRuleSetupTeardownChained.java:50)
[junit4] 2> at org.apache.lucene.util.TestRuleFieldCacheSanity$1.evaluate(TestRuleFieldCacheSanity.java:32)
[junit4] 2> at org.apache.lucene.util.AbstractBeforeAfterRule$1.evaluate(AbstractBeforeAfterRule.java:45)
[junit4] 2> at com.carrotsearch.randomizedtesting.rules.SystemPropertiesInvariantRule$1.evaluate(SystemPropertiesInvariantRule.java:55)
[junit4] 2> at org.apache.lucene.util.TestRuleReportUncaughtExceptions$1.evaluate(TestRuleReportUncaughtExceptions.java:68)
[junit4] 2> at org.apache.lucene.util.TestRuleThreadAndTestName$1.evaluate(TestRuleThreadAndTestName.java:48)
[junit4] 2> at org.apache.lucene.util.TestRuleMarkFailure$1.evaluate(TestRuleMarkFailure.java:48)
[junit4] 2> at com.carrotsearch.randomizedtesting.RandomizedRunner.runSingleTest(RandomizedRunner.java:821)
[junit4] 2> at com.carrotsearch.randomizedtesting.RandomizedRunner.access$700(RandomizedRunner.java:132)
[junit4] 2> at com.carrotsearch.randomizedtesting.RandomizedRunner$3$1.run(RandomizedRunner.java:669)
[junit4] 2> at com.carrotsearch.randomizedtesting.RandomizedRunner$3.evaluate(RandomizedRunner.java:695)
[junit4] 2> at com.carrotsearch.randomizedtesting.RandomizedRunner$4.evaluate(RandomizedRunner.java:734)
[junit4] 2> at com.carrotsearch.randomizedtesting.RandomizedRunner$5.evaluate(RandomizedRunner.java:745)
[junit4] 2> at com.carrotsearch.randomizedtesting.rules.SystemPropertiesRestoreRule$1.evaluate(SystemPropertiesRestoreRule.java:53)
[junit4] 2> at org.apache.lucene.util.AbstractBeforeAfterRule$1.evaluate(AbstractBeforeAfterRule.java:45)
[junit4] 2> at org.apache.lucene.util.TestRuleReportUncaughtExceptions$1.evaluate(TestRuleReportUncaughtExceptions.java:68)
[junit4] 2> at org.apache.lucene.util.TestRuleStoreClassName$1.evaluate(TestRuleStoreClassName.java:38)
[junit4] 2> at org.apache.lucene.util.TestRuleIcuHack$1.evaluate(TestRuleIcuHack.java:51)
[junit4] 2> at com.carrotsearch.randomizedtesting.rules.SystemPropertiesInvariantRule$1.evaluate(SystemPropertiesInvariantRule.java:55)
[junit4] 2> at org.apache.lucene.util.TestRuleNoInstanceHooksOverrides$1.evaluate(TestRuleNoInstanceHooksOverrides.java:53)
[junit4] 2> at org.apache.lucene.util.TestRuleNoStaticHooksShadowing$1.evaluate(TestRuleNoStaticHooksShadowing.java:52)
[junit4] 2> at org.apache.lucene.util.TestRuleAssertionsRequired$1.evaluate(TestRuleAssertionsRequired.java:36)
[junit4] 2> at org.apache.lucene.util.TestRuleMarkFailure$1.evaluate(TestRuleMarkFailure.java:48)
[junit4] 2> at org.apache.lucene.util.TestRuleIgnoreTestSuites$1.evaluate(TestRuleIgnoreTestSuites.java:56)
[junit4] 2> at com.carrotsearch.randomizedtesting.RandomizedRunner.runSuite(RandomizedRunner.java:605)
[junit4] 2> at com.carrotsearch.randomizedtesting.RandomizedRunner.access$400(RandomizedRunner.java:132)
[junit4] 2> at com.carrotsearch.randomizedtesting.RandomizedRunner$2.run(RandomizedRunner.java:551)
[junit4] 2>
[junit4] 2> 4206 T1042 oashc.SpellCheckComponent.inform Registering newSearcher listener for spellchecker: suggest_wfst
[junit4] 2> 4206 T1042 oashc.SpellCheckComponent.inform No queryConverter defined, using default converter
[junit4] 2> 4207 T1042 oashc.HttpShardHandlerFactory.getParameter Setting socketTimeout to: 0
[junit4] 2> 4207 T1042 oashc.HttpShardHandlerFactory.getParameter Setting urlScheme to: http://
[junit4] 2> 4207 T1042 oashc.HttpShardHandlerFactory.getParameter Setting connTimeout to: 0
[junit4] 2> 4207 T1042 oashc.HttpShardHandlerFactory.getParameter Setting maxConnectionsPerHost to: 20
[junit4] 2> 4207 T1042 oashc.HttpShardHandlerFactory.getParameter Setting corePoolSize to: 0
[junit4] 2> 4208 T1042 oashc.HttpShardHandlerFactory.getParameter Setting maximumPoolSize to: 2147483647
[junit4] 2> 4209 T1042 oashc.HttpShardHandlerFactory.getParameter Setting maxThreadIdleTime to: 5
[junit4] 2> 4209 T1042 oashc.HttpShardHandlerFactory.getParameter Setting sizeOfQueue to: -1
[junit4] 2> 4209 T1042 oashc.HttpShardHandlerFactory.getParameter Setting fairnessPolicy to: false
[junit4] 2> 4209 T1042 oascsi.HttpClientUtil.createClient Creating new http client, config:maxConnectionsPerHost=20&maxConnections=10000&socketTimeout=0&connTimeout=0&retry=false
[junit4] 2> 4217 T1044 oasc.SolrCore.registerSearcher [collection1] Registered new searcher Searcher [at] 1b51c6c main{StandardDirectoryReader(segments_2:3 _0(5.0):C3)}
[junit4] 2> 4219 T1042 oasc.CoreContainer.register registering core: collection1
[junit4] 2> 4220 T1042 oas.SolrTestCaseJ4.initCore ####initCore end
[junit4] 2> ASYNC NEW_CORE C63 name=collection1 org.apache.solr.core.SolrCore [at] 7d93953
[junit4] 2> 4221 T1042 C63 oasc.SolrException.log SEVERE java.lang.NullPointerException
[junit4] 2> at org.apache.lucene.search.suggest.fst.FSTCompletionLookup.lookup(FSTCompletionLookup.java:239)
[junit4] 2> at org.apache.solr.spelling.suggest.Suggester.getSuggestions(Suggester.java:188)
[junit4] 2> at org.apache.solr.handler.component.SpellCheckComponent.process(SpellCheckComponent.java:172)
[junit4] 2> at org.apache.solr.handler.component.SearchHandler.handleRequestBody(SearchHandler.java:204)
[junit4] 2> at org.apache.solr.handler.RequestHandlerBase.handleRequest(RequestHandlerBase.java:129)
[junit4] 2> at org.apache.solr.core.SolrCore.execute(SolrCore.java:1561)
[junit4] 2> at org.apache.solr.util.TestHarness.query(TestHarness.java:357)
[junit4] 2> at org.apache.solr.util.TestHarness.query(TestHarness.java:340)
[junit4] 2> at org.apache.solr.SolrTestCaseJ4.assertQ(SolrTestCaseJ4.java:433)
[junit4] 2> at org.apache.solr.SolrTestCaseJ4.assertQ(SolrTestCaseJ4.java:426)
[junit4] 2> at org.apache.solr.spelling.suggest.SuggesterTest.testReload(SuggesterTest.java:91)
[junit4] 2> at sun.reflect.NativeMethodAccessorImpl.invoke0(Native Method)
[junit4] 2> at sun.reflect.NativeMethodAccessorImpl.invoke(NativeMethodAccessorImpl.java:57)
[junit4] 2> at sun.reflect.DelegatingMethodAccessorImpl.invoke(DelegatingMethodAccessorImpl.java:43)
[junit4] 2> at java.lang.reflect.Method.invoke(Method.java:601)
[junit4] 2> at com.carrotsearch.randomizedtesting.RandomizedRunner.invoke(RandomizedRunner.java:1969)
[junit4] 2> at com.carrotsearch.randomizedtesting.RandomizedRunner.access$1100(RandomizedRunner.java:132)
[junit4] 2> at com.carrotsearch.randomizedtesting.RandomizedRunner$6.evaluate(RandomizedRunner.java:814)
[junit4] 2> at com.carrotsearch.randomizedtesting.RandomizedRunner$7.evaluate(RandomizedRunner.java:875)
[junit4] 2> at com.carrotsearch.randomizedtesting.RandomizedRunner$8.evaluate(RandomizedRunner.java:889)
[junit4] 2> at com.carrotsearch.randomizedtesting.rules.SystemPropertiesRestoreRule$1.evaluate(SystemPropertiesRestoreRule.java:53)
[junit4] 2> at org.apache.lucene.util.TestRuleSetupTeardownChained$1.evaluate(TestRuleSetupTeardownChained.java:50)
[junit4] 2> at org.apache.lucene.util.TestRuleFieldCacheSanity$1.evaluate(TestRuleFieldCacheSanity.java:32)
[junit4] 2> at org.apache.lucene.util.AbstractBeforeAfterRule$1.evaluate(AbstractBeforeAfterRule.java:45)
[junit4] 2> at com.carrotsearch.randomizedtesting.rules.SystemPropertiesInvariantRule$1.evaluate(SystemPropertiesInvariantRule.java:55)
[junit4] 2> at org.apache.lucene.util.TestRuleReportUncaughtExceptions$1.evaluate(TestRuleReportUncaughtExceptions.java:68)
[junit4] 2> at org.apache.lucene.util.TestRuleThreadAndTestName$1.evaluate(TestRuleThreadAndTestName.java:48)
[junit4] 2> at org.apache.lucene.util.TestRuleMarkFailure$1.evaluate(TestRuleMarkFailure.java:48)
[junit4] 2> at com.carrotsearch.randomizedtesting.RandomizedRunner.runSingleTest(RandomizedRunner.java:821)
[junit4] 2> at com.carrotsearch.randomizedtesting.RandomizedRunner.access$700(RandomizedRunner.java:132)
[junit4] 2> at com.carrotsearch.randomizedtesting.RandomizedRunner$3$1.run(RandomizedRunner.java:669)
[junit4] 2> at com.carrotsearch.randomizedtesting.RandomizedRunner$3.evaluate(RandomizedRunner.java:695)
[junit4] 2> at com.carrotsearch.randomizedtesting.RandomizedRunner$4.evaluate(RandomizedRunner.java:734)
[junit4] 2> at com.carrotsearch.randomizedtesting.RandomizedRunner$5.evaluate(RandomizedRunner.java:745)
[junit4] 2> at com.carrotsearch.randomizedtesting.rules.SystemPropertiesRestoreRule$1.evaluate(SystemPropertiesRestoreRule.java:53)
[junit4] 2> at org.apache.lucene.util.AbstractBeforeAfterRule$1.evaluate(AbstractBeforeAfterRule.java:45)
[junit4] 2> at org.apache.lucene.util.TestRuleReportUncaughtExceptions$1.evaluate(TestRuleReportUncaughtExceptions.java:68)
[junit4] 2> at org.apache.lucene.util.TestRuleStoreClassName$1.evaluate(TestRuleStoreClassName.java:38)
[junit4] 2> at org.apache.lucene.util.TestRuleIcuHack$1.evaluate(TestRuleIcuHack.java:51)
[junit4] 2> at com.carrotsearch.randomizedtesting.rules.SystemPropertiesInvariantRule$1.evaluate(SystemPropertiesInvariantRule.java:55)
[junit4] 2> at org.apache.lucene.util.TestRuleNoInstanceHooksOverrides$1.evaluate(TestRuleNoInstanceHooksOverrides.java:53)
[junit4] 2> at org.apache.lucene.util.TestRuleNoStaticHooksShadowing$1.evaluate(TestRuleNoStaticHooksShadowing.java:52)
[junit4] 2> at org.apache.lucene.util.TestRuleAssertionsRequired$1.evaluate(TestRuleAssertionsRequired.java:36)
[junit4] 2> at org.apache.lucene.util.TestRuleMarkFailure$1.evaluate(TestRuleMarkFailure.java:48)
[junit4] 2> at org.apache.lucene.util.TestRuleIgnoreTestSuites$1.evaluate(TestRuleIgnoreTestSuites.java:56)
[junit4] 2> at com.carrotsearch.randomizedtesting.RandomizedRunner.runSuite(RandomizedRunner.java:605)
[junit4] 2> at com.carrotsearch.randomizedtesting.RandomizedRunner.access$400(RandomizedRunner.java:132)
[junit4] 2> at com.carrotsearch.randomizedtesting.RandomizedRunner$2.run(RandomizedRunner.java:551)
[junit4] 2>
[junit4] 2> 4222 T1042 C63 REQ [collection1] webapp=null path=null params={q=ac&spellcheck.count=2&qt=/suggest_fst&spellcheck.onlyMorePopular=true} status=500 QTime=2
[junit4] 2> 4222 T1042 oasc.SolrException.log SEVERE REQUEST FAILED: q=ac&spellcheck.count=2&qt=/suggest_fst&spellcheck.onlyMorePopular=true:java.lang.NullPointerException
[junit4] 2> at org.apache.lucene.search.suggest.fst.FSTCompletionLookup.lookup(FSTCompletionLookup.java:239)
[junit4] 2> at org.apache.solr.spelling.suggest.Suggester.getSuggestions(Suggester.java:188)
[junit4] 2> at org.apache.solr.handler.component.SpellCheckComponent.process(SpellCheckComponent.java:172)
[junit4] 2> at org.apache.solr.handler.component.SearchHandler.handleRequestBody(SearchHandler.java:204)
[junit4] 2> at org.apache.solr.handler.RequestHandlerBase.handleRequest(RequestHandlerBase.java:129)
[junit4] 2> at org.apache.solr.core.SolrCore.execute(SolrCore.java:1561)
[junit4] 2> at org.apache.solr.util.TestHarness.query(TestHarness.java:357)
[junit4] 2> at org.apache.solr.util.TestHarness.query(TestHarness.java:340)
[junit4] 2> at org.apache.solr.SolrTestCaseJ4.assertQ(SolrTestCaseJ4.java:433)
[junit4] 2> at org.apache.solr.SolrTestCaseJ4.assertQ(SolrTestCaseJ4.java:426)
[junit4] 2> at org.apache.solr.spelling.suggest.SuggesterTest.testReload(SuggesterTest.java:91)
[junit4] 2> at sun.reflect.NativeMethodAccessorImpl.invoke0(Native Method)
[junit4] 2> at sun.reflect.NativeMethodAccessorImpl.invoke(NativeMethodAccessorImpl.java:57)
[junit4] 2> at sun.reflect.DelegatingMethodAccessorImpl.invoke(DelegatingMethodAccessorImpl.java:43)
[junit4] 2> at java.lang.reflect.Method.invoke(Method.java:601)
[junit4] 2> at com.carrotsearch.randomizedtesting.RandomizedRunner.invoke(RandomizedRunner.java:1969)
[junit4] 2> at com.carrotsearch.randomizedtesting.RandomizedRunner.access$1100(RandomizedRunner.java:132)
[junit4] 2> at com.carrotsearch.randomizedtesting.RandomizedRunner$6.evaluate(RandomizedRunner.java:814)
[junit4] 2> at com.carrotsearch.randomizedtesting.RandomizedRunner$7.evaluate(RandomizedRunner.java:875)
[junit4] 2> at com.carrotsearch.randomizedtesting.RandomizedRunner$8.evaluate(RandomizedRunner.java:889)
[junit4] 2> at com.carrotsearch.randomizedtesting.rules.SystemPropertiesRestoreRule$1.evaluate(SystemPropertiesRestoreRule.java:53)
[junit4] 2> at org.apache.lucene.util.TestRuleSetupTeardownChained$1.evaluate(TestRuleSetupTeardownChained.java:50)
[junit4] 2> at org.apache.lucene.util.TestRuleFieldCacheSanity$1.evaluate(TestRuleFieldCacheSanity.java:32)
[junit4] 2> at org.apache.lucene.util.AbstractBeforeAfterRule$1.evaluate(AbstractBeforeAfterRule.java:45)
[junit4] 2> at com.carrotsearch.randomizedtesting.rules.SystemPropertiesInvariantRule$1.evaluate(SystemPropertiesInvariantRule.java:55)
[junit4] 2> at org.apache.lucene.util.TestRuleReportUncaughtExceptions$1.evaluate(TestRuleReportUncaughtExceptions.java:68)
[junit4] 2> at org.apache.lucene.util.TestRuleThreadAndTestName$1.evaluate(TestRuleThreadAndTestName.java:48)
[junit4] 2> at org.apache.lucene.util.TestRuleMarkFailure$1.evaluate(TestRuleMarkFailure.java:48)
[junit4] 2> at com.carrotsearch.randomizedtesting.RandomizedRunner.runSingleTest(RandomizedRunner.java:821)
[junit4] 2> at com.carrotsearch.randomizedtesting.RandomizedRunner.access$700(RandomizedRunner.java:132)
[junit4] 2> at com.carrotsearch.randomizedtesting.RandomizedRunner$3$1.run(RandomizedRunner.java:669)
[junit4] 2> at com.carrotsearch.randomizedtesting.RandomizedRunner$3.evaluate(RandomizedRunner.java:695)
[junit4] 2> at com.carrotsearch.randomizedtesting.RandomizedRunner$4.evaluate(RandomizedRunner.java:734)
[junit4] 2> at com.carrotsearch.randomizedtesting.RandomizedRunner$5.evaluate(RandomizedRunner.java:745)
[junit4] 2> at com.carrotsearch.randomizedtesting.rules.SystemPropertiesRestoreRule$1.evaluate(SystemPropertiesRestoreRule.java:53)
[junit4] 2> at org.apache.lucene.util.AbstractBeforeAfterRule$1.evaluate(AbstractBeforeAfterRule.java:45)
[junit4] 2> at org.apache.lucene.util.TestRuleReportUncaughtExceptions$1.evaluate(TestRuleReportUncaughtExceptions.java:68)
[junit4] 2> at org.apache.lucene.util.TestRuleStoreClassName$1.evaluate(TestRuleStoreClassName.java:38)
[junit4] 2> at org.apache.lucene.util.TestRuleIcuHack$1.evaluate(TestRuleIcuHack.java:51)
[junit4] 2> at com.carrotsearch.randomizedtesting.rules.SystemPropertiesInvariantRule$1.evaluate(SystemPropertiesInvariantRule.java:55)
[junit4] 2> at org.apache.lucene.util.TestRuleNoInstanceHooksOverrides$1.evaluate(TestRuleNoInstanceHooksOverrides.java:53)
[junit4] 2> at org.apache.lucene.util.TestRuleNoStaticHooksShadowing$1.evaluate(TestRuleNoStaticHooksShadowing.java:52)
[junit4] 2> at org.apache.lucene.util.TestRuleAssertionsRequired$1.evaluate(TestRuleAssertionsRequired.java:36)
[junit4] 2> at org.apache.lucene.util.TestRuleMarkFailure$1.evaluate(TestRuleMarkFailure.java:48)
[junit4] 2> at org.apache.lucene.util.TestRuleIgnoreTestSuites$1.evaluate(TestRuleIgnoreTestSuites.java:56)
[junit4] 2> at com.carrotsearch.randomizedtesting.RandomizedRunner.runSuite(RandomizedRunner.java:605)
[junit4] 2> at com.carrotsearch.randomizedtesting.RandomizedRunner.access$400(RandomizedRunner.java:132)
[junit4] 2> at com.carrotsearch.randomizedtesting.RandomizedRunner$2.run(RandomizedRunner.java:551)
[junit4] 2>
[junit4] 2> 4223 T1042 oas.SolrTestCaseJ4.tearDown ###Ending testReload
[junit4] 2> NOTE: reproduce with: ant test -Dtestcase=SuggesterFSTTest -Dtests.method=testReload -Dtests.seed=CAC2E0CFF6683C02 -Dtests.locale=ms_MY -Dtests.timezone=America/Matamoros -Dargs="-Dfile.encoding=Cp1252"
[junit4] 2>
[junit4] > (@AfterClass output)
[junit4] 2> 4797 T1042 oas.SolrTestCaseJ4.deleteCore ###deleteCore
[junit4] 2> 4798 T1042 oasc.CoreContainer.shutdown Shutting down CoreContainer instance=2061154675
[junit4] 2> 4798 T1042 oasc.SolrCore.close [collection1] CLOSING SolrCore org.apache.solr.core.SolrCore [at] 7d93953
[junit4] 2> 4798 T1042 oasc.SolrCore.closeSearcher [collection1] Closing main searcher on request.
[junit4] 2> 4799 T1042 oasu.DirectUpdateHandler2.close closing DirectUpdateHandler2{commits=3,autocommits=0,soft autocommits=0,optimizes=0,rollbacks=0,expungeDeletes=0,docsPending=0,adds=0,deletesById=0,deletesByQuery=0,errors=0,cumulative_adds=7,cumulative_deletesById=0,cumulative_deletesByQuery=0,cumulative_errors=0}
[junit4] 2> NOTE: test params are: codec=Lucene40: {}, sim=RandomSimilarityProvider(queryNorm=false,coord=true): {}, locale=ms_MY, timezone=America/Matamoros
[junit4] 2> NOTE: Windows 7 6.1 amd64/Oracle Corporation 1.7.0_04 (64-bit)/cpus=2,threads=1,free=169969608,total=252248064
[junit4] 2> NOTE: All tests run in this JVM: [.RecoveryZkTest, RequiredFieldsTest, TestReversedWildcardFilterFactory, TestPluginEnable, TestKStemFilterFactory, TestElisionFilterFactory, TestFiltering, TestKeywordMarkerFilterFactory, TestHyphenationCompoundWordTokenFilterFactory, TestArbitraryIndexDir, TestJapaneseBaseFormFilterFactory, OutputWriterTest, TestGermanLightStemFilterFactory, TestFastLRUCache, MinimalSchemaTest, TestPortugueseStemFilterFactory, TestKeepFilterFactory, TestPseudoReturnFields, TestPatternReplaceCharFilterFactory, SuggesterTest, UUIDFieldTest, TestJapaneseReadingFormFilterFactory, BadComponentTest, UpdateParamsTest, BasicZkTest, TestTypeTokenFilterFactory, TestSort, TestPatternTokenizerFactory, TestBinaryField, SuggesterTSTTest, TestCJKBigramFilterFactory, TestLMDirichletSimilarityFactory, DistributedSpellCheckComponentTest, TestPropInjectDefaults, TestPropInject, ReturnFieldsTest, SolrCmdDistributorTest, LukeRequestHandlerTest, ConvertedLegacyTest, StatsComponentTest, SpellCheckCollatorTest, TestGermanStemFilterFactory, SpellCheckComponentTest, SolrCoreCheckLockOnStartupTest, TestIndexingPerformance, TestSynonymFilterFactory, ZkSolrClientTest, CommonGramsFilterFactoryTest, TestRecovery, TestMappingCharFilterFactory, TestPortugueseLightStemFilterFactory, FieldMutatingUpdateProcessorTest, TestDFRSimilarityFactory, TestStopFilterFactory, ResourceLoaderTest, TestIndexSearcher, TestBeiderMorseFilterFactory, TestGreekLowerCaseFilterFactory, TestSuggestSpellingConverter, TestWordDelimiterFilterFactory, SuggesterWFSTTest, TestThaiWordFilterFactory, TestNGramFilters, PrimUtilsTest, SoftAutoCommitTest, ZkControllerTest, TestLMJelinekMercerSimilarityFactory, SOLR749Test, TestRealTimeGet, StandardRequestHandlerTest, SuggesterFSTTest]
[junit4] 2>
[junit4] Completed in 4.89s, 4 tests, 1 error <<< FAILURES!

[...truncated 645 lines...]
BUILD FAILED
C:\Jenkins\workspace\Lucene-Solr-trunk-Windows-Java7-64\build.xml:29: The following error occurred while executing this line:
C:\Jenkins\workspace\Lucene-Solr-trunk-Windows-Java7-64\solr\build.xml:144: The following error occurred while executing this line:
C:\Jenkins\workspace\Lucene-Solr-trunk-Windows-Java7-64\lucene\module-build.xml:62: The following error occurred while executing this line:
C:\Jenkins\workspace\Lucene-Solr-trunk-Windows-Java7-64\lucene\common-build.xml:1037: The following error occurred while executing this line:
C:\Jenkins\workspace\Lucene-Solr-trunk-Windows-Java7-64\lucene\common-build.xml:758: There were test failures: 282 suites, 1018 tests, 1 error, 10 ignored (5 assumptions)

Total time: 40 minutes 25 seconds
Build step 'Invoke Ant' marked build as failure
Recording test results
Email was triggered for: Failure
Sending email for trigger: Failure

Lucene java-dev RSS feed   Index | Next | Previous | View Threaded
 
 


Interested in having your list archived? Contact Gossamer Threads
 
  Web Applications & Managed Hosting Powered by Gossamer Threads Inc.