Login | Register For Free | Help
Search for: (Advanced)

Mailing List Archive: Lucene: Java-Dev

Build failed in Jenkins: Lucene-Solr-trunk-Windows-Java7-64 #128

 

 

Lucene java-dev RSS feed   Index | Next | Previous | View Threaded


jenkins at sd-datasolutions

May 25, 2012, 6:02 PM

Post #1 of 1 (54 views)
Permalink
Build failed in Jenkins: Lucene-Solr-trunk-Windows-Java7-64 #128

See <http://jenkins.sd-datasolutions.de/job/Lucene-Solr-trunk-Windows-Java7-64/128/>

------------------------------------------
[...truncated 11441 lines...]
[junit4] 2> request was:q=ac&spellcheck.count=2&qt=/suggest_tst&spellcheck.onlyMorePopular=true
[junit4] 2> 476 T3554 oasc.SolrException.log SEVERE REQUEST FAILED: q=ac&spellcheck.count=2&qt=/suggest_tst&spellcheck.onlyMorePopular=true:java.lang.RuntimeException: REQUEST FAILED: xpath=//lst[@name='spellcheck']/lst[@name='suggestions']/lst[@name='ac']/int[@name='numFound'][.='2']
[junit4] 2> xml response was: <?xml version="1.0" encoding="UTF-8"?>
[junit4] 2> <response>
[junit4] 2> <lst name="responseHeader"><int name="status">0</int><int name="QTime">1</int></lst><lst name="spellcheck"><lst name="suggestions"/></lst>
[junit4] 2> </response>
[junit4] 2>
[junit4] 2> request was:q=ac&spellcheck.count=2&qt=/suggest_tst&spellcheck.onlyMorePopular=true
[junit4] 2> at org.apache.solr.SolrTestCaseJ4.assertQ(SolrTestCaseJ4.java:452)
[junit4] 2> at org.apache.solr.SolrTestCaseJ4.assertQ(SolrTestCaseJ4.java:426)
[junit4] 2> at org.apache.solr.spelling.suggest.SuggesterTest.testRebuild(SuggesterTest.java:105)
[junit4] 2> at sun.reflect.NativeMethodAccessorImpl.invoke0(Native Method)
[junit4] 2> at sun.reflect.NativeMethodAccessorImpl.invoke(NativeMethodAccessorImpl.java:57)
[junit4] 2> at sun.reflect.DelegatingMethodAccessorImpl.invoke(DelegatingMethodAccessorImpl.java:43)
[junit4] 2> at java.lang.reflect.Method.invoke(Method.java:601)
[junit4] 2> at com.carrotsearch.randomizedtesting.RandomizedRunner.invoke(RandomizedRunner.java:1969)
[junit4] 2> at com.carrotsearch.randomizedtesting.RandomizedRunner.access$1100(RandomizedRunner.java:132)
[junit4] 2> at com.carrotsearch.randomizedtesting.RandomizedRunner$6.evaluate(RandomizedRunner.java:814)
[junit4] 2> at com.carrotsearch.randomizedtesting.RandomizedRunner$7.evaluate(RandomizedRunner.java:875)
[junit4] 2> at com.carrotsearch.randomizedtesting.RandomizedRunner$8.evaluate(RandomizedRunner.java:889)
[junit4] 2> at com.carrotsearch.randomizedtesting.rules.SystemPropertiesRestoreRule$1.evaluate(SystemPropertiesRestoreRule.java:53)
[junit4] 2> at org.apache.lucene.util.TestRuleSetupTeardownChained$1.evaluate(TestRuleSetupTeardownChained.java:50)
[junit4] 2> at org.apache.lucene.util.TestRuleFieldCacheSanity$1.evaluate(TestRuleFieldCacheSanity.java:32)
[junit4] 2> at org.apache.lucene.util.AbstractBeforeAfterRule$1.evaluate(AbstractBeforeAfterRule.java:45)
[junit4] 2> at com.carrotsearch.randomizedtesting.rules.SystemPropertiesInvariantRule$1.evaluate(SystemPropertiesInvariantRule.java:55)
[junit4] 2> at org.apache.lucene.util.TestRuleReportUncaughtExceptions$1.evaluate(TestRuleReportUncaughtExceptions.java:68)
[junit4] 2> at org.apache.lucene.util.TestRuleThreadAndTestName$1.evaluate(TestRuleThreadAndTestName.java:48)
[junit4] 2> at org.apache.lucene.util.TestRuleMarkFailure$1.evaluate(TestRuleMarkFailure.java:48)
[junit4] 2> at com.carrotsearch.randomizedtesting.RandomizedRunner.runSingleTest(RandomizedRunner.java:821)
[junit4] 2> at com.carrotsearch.randomizedtesting.RandomizedRunner.access$700(RandomizedRunner.java:132)
[junit4] 2> at com.carrotsearch.randomizedtesting.RandomizedRunner$3$1.run(RandomizedRunner.java:669)
[junit4] 2> at com.carrotsearch.randomizedtesting.RandomizedRunner$3.evaluate(RandomizedRunner.java:695)
[junit4] 2> at com.carrotsearch.randomizedtesting.RandomizedRunner$4.evaluate(RandomizedRunner.java:734)
[junit4] 2> at com.carrotsearch.randomizedtesting.RandomizedRunner$5.evaluate(RandomizedRunner.java:745)
[junit4] 2> at com.carrotsearch.randomizedtesting.rules.SystemPropertiesRestoreRule$1.evaluate(SystemPropertiesRestoreRule.java:53)
[junit4] 2> at org.apache.lucene.util.AbstractBeforeAfterRule$1.evaluate(AbstractBeforeAfterRule.java:45)
[junit4] 2> at org.apache.lucene.util.TestRuleReportUncaughtExceptions$1.evaluate(TestRuleReportUncaughtExceptions.java:68)
[junit4] 2> at org.apache.lucene.util.TestRuleStoreClassName$1.evaluate(TestRuleStoreClassName.java:38)
[junit4] 2> at org.apache.lucene.util.TestRuleIcuHack$1.evaluate(TestRuleIcuHack.java:51)
[junit4] 2> at com.carrotsearch.randomizedtesting.rules.SystemPropertiesInvariantRule$1.evaluate(SystemPropertiesInvariantRule.java:55)
[junit4] 2> at org.apache.lucene.util.TestRuleNoInstanceHooksOverrides$1.evaluate(TestRuleNoInstanceHooksOverrides.java:53)
[junit4] 2> at org.apache.lucene.util.TestRuleNoStaticHooksShadowing$1.evaluate(TestRuleNoStaticHooksShadowing.java:52)
[junit4] 2> at org.apache.lucene.util.TestRuleAssertionsRequired$1.evaluate(TestRuleAssertionsRequired.java:36)
[junit4] 2> at org.apache.lucene.util.TestRuleMarkFailure$1.evaluate(TestRuleMarkFailure.java:48)
[junit4] 2> at org.apache.lucene.util.TestRuleIgnoreTestSuites$1.evaluate(TestRuleIgnoreTestSuites.java:56)
[junit4] 2> at com.carrotsearch.randomizedtesting.RandomizedRunner.runSuite(RandomizedRunner.java:605)
[junit4] 2> at com.carrotsearch.randomizedtesting.RandomizedRunner.access$400(RandomizedRunner.java:132)
[junit4] 2> at com.carrotsearch.randomizedtesting.RandomizedRunner$2.run(RandomizedRunner.java:551)
[junit4] 2>
[junit4] 2> 478 T3554 oas.SolrTestCaseJ4.tearDown ###Ending testRebuild
[junit4] 2> NOTE: reproduce with: ant test -Dtestcase=SuggesterTSTTest -Dtests.method=testRebuild -Dtests.seed=6E408A4A3377AC28 -Dtests.locale=en_NZ -Dtests.timezone=Africa/Timbuktu -Dargs="-Dfile.encoding=Cp1252"
[junit4] 2>
[junit4] > (@AfterClass output)
[junit4] 2> 2289 T3554 oas.SolrTestCaseJ4.deleteCore ###deleteCore
[junit4] 2> 2290 T3554 oasc.CoreContainer.shutdown Shutting down CoreContainer instance=1009603802
[junit4] 2> 2290 T3554 oasc.SolrCore.close [collection1] CLOSING SolrCore org.apache.solr.core.SolrCore [at] 211b789
[junit4] 2> 2291 T3554 oasc.SolrCore.closeSearcher [collection1] Closing main searcher on request.
[junit4] 2> 2291 T3554 oasu.DirectUpdateHandler2.close closing DirectUpdateHandler2{commits=1,autocommits=0,soft autocommits=0,optimizes=0,rollbacks=0,expungeDeletes=0,docsPending=0,adds=0,deletesById=0,deletesByQuery=0,errors=0,cumulative_adds=3,cumulative_deletesById=0,cumulative_deletesByQuery=0,cumulative_errors=0}
[junit4] 2> NOTE: test params are: codec=Lucene40, sim=DefaultSimilarity, locale=en_NZ, timezone=Africa/Timbuktu
[junit4] 2> NOTE: Windows 7 6.1 amd64/Oracle Corporation 1.7.0_04 (64-bit)/cpus=2,threads=1,free=50990008,total=301924352
[junit4] 2> NOTE: All tests run in this JVM: [.TestDocSet, TestNumberUtils, TestQuerySenderListener, TestCodecSupport, FileUtilsTest, DocumentAnalysisRequestHandlerTest, TestSwedishLightStemFilterFactory, ShowFileRequestHandlerTest, HighlighterConfigTest, TestHTMLStripCharFilterFactory, TestCzechStemFilterFactory, TestGermanMinimalStemFilterFactory, AlternateDirectoryTest, DirectSolrSpellCheckerTest, TestSynonymMap, TestFaceting, UpdateParamsTest, CurrencyFieldTest, UUIDFieldTest, TestNorwegianMinimalStemFilterFactory, TestRussianFilters, PrimUtilsTest, TestLatvianStemFilterFactory, DocumentBuilderTest, TestCJKTokenizerFactory, TestStopFilterFactory, XsltUpdateRequestHandlerTest, TestConfig, StatsComponentTest, FastVectorHighlighterTest, CSVRequestHandlerTest, TestFoldingMultitermQuery, TestHunspellStemFilterFactory, TestSolrCoreProperties, BasicFunctionalityTest, PingRequestHandlerTest, SolrRequestParserTest, CommonGramsFilterFactoryTest, TestEnglishMinimalStemFilterFactory, TestLMDirichletSimilarityFactory, TestSurroundQueryParser, SolrCoreTest, ZkSolrClientTest, TestFrenchLightStemFilterFactory, FullSolrCloudTest, TestThaiWordFilterFactory, SpellCheckComponentTest, TestJmxMonitoredMap, TestValueSourceCache, SolrPluginUtilsTest, TestNGramFilters, TestReplicationHandler, TestSolrDeletionPolicy2, TestKStemFilterFactory, UpdateRequestProcessorFactoryTest, TestSolrDeletionPolicy1, TestRecovery, TestStemmerOverrideFilterFactory, TestSearchPerf, SystemInfoHandlerTest, MinimalSchemaTest, TestPseudoReturnFields, TestDistributedSearch, TestGroupingSearch, ConvertedLegacyTest, DateFieldTest, TestPhoneticFilterFactory, TestGermanLightStemFilterFactory, DebugComponentTest, TestUAX29URLEmailTokenizerFactory, MoreLikeThisHandlerTest, TestChineseTokenizerFactory, SuggesterWFSTTest, TestTrie, BadIndexSchemaTest, DistributedTermsComponentTest, SimpleFacetsTest, TestIndexingPerformance, ZkControllerTest, LengthFilterTest, TestFiltering, BasicZkTest, RAMDirectoryFactoryTest, FieldAnalysisRequestHandlerTest, IndexBasedSpellCheckerTest, SuggesterTest, TestBeiderMorseFilterFactory, CloudStateUpdateTest, TestPropInjectDefaults, OverseerTest, TestSpanishLightStemFilterFactory, TestStandardFactories, IndexSchemaRuntimeFieldTest, LegacyHTMLStripCharFilterTest, TestGalicianMinimalStemFilterFactory, TestGermanStemFilterFactory, TestPortugueseStemFilterFactory, UniqFieldsUpdateProcessorFactoryTest, PolyFieldTest, TestReversedWildcardFilterFactory, TestJoin, TestJmxIntegration, TestIrishLowerCaseFilterFactory, TermVectorComponentTest, TestCSVLoader, TestHindiFilters, TestIBSimilarityFactory, TestCJKBigramFilterFactory, SoftAutoCommitTest, TestGalicianStemFilterFactory, NoCacheHeaderTest, TestSolrQueryParser, TestExtendedDismaxParser, TestBinaryField, CacheHeaderTest, TestLFUCache, TestNorwegianLightStemFilterFactory, TestPerFieldSimilarity, AutoCommitTest, ZkNodePropsTest, TestPortugueseLightStemFilterFactory, TestHungarianLightStemFilterFactory, StandardRequestHandlerTest, TestDefaultSimilarityFactory, TestDictionaryCompoundWordTokenFilterFactory, DirectSolrConnectionTest, TestShingleFilterFactory, SolrCoreCheckLockOnStartupTest, NodeStateWatcherTest, OpenExchangeRatesOrgProviderTest, TestUtils, DoubleMetaphoneFilterFactoryTest, TestSystemIdResolver, SolrInfoMBeanTest, SnowballPorterFilterFactoryTest, LeaderElectionTest, TestChineseFilterFactory, DirectUpdateHandlerOptimizeTest, TestRealTimeGet, TestHashPartitioner, TestRemoteStreaming, TestBadConfig, TestFastLRUCache, CommonGramsQueryFilterFactoryTest, NotRequiredUniqueKeyTest, DateMathParserTest, SpellCheckCollatorTest, TestReverseStringFilterFactory, TestDistributedGrouping, TestBinaryResponseWriter, TestPHPSerializedResponseWriter, TestElisionFilterFactory, BasicDistributedZkTest, LukeRequestHandlerTest, TestFinnishLightStemFilterFactory, TestCollationKeyFilterFactory, CloudStateTest, TestJapaneseBaseFormFilterFactory, TestSolrXMLSerializer, TestDelimitedPayloadTokenFilterFactory, TestBM25SimilarityFactory, TestPatternReplaceCharFilterFactory, TestFrenchMinimalStemFilterFactory, TestUpdate, TestArabicFilters, TestRangeQuery, TestMergePolicyConfig, FieldMutatingUpdateProcessorTest, MBeansHandlerTest, TestArbitraryIndexDir, TestRussianLightStemFilterFactory, TestCollationKeyRangeQueries, JSONWriterTest, TestWordDelimiterFilterFactory, TestTypeTokenFilterFactory, DisMaxRequestHandlerTest, RequestHandlersTest, TestPropInject, CoreAdminHandlerTest, TestXIncludeConfig, CopyFieldTest, SignatureUpdateProcessorFactoryTest, TestGermanNormalizationFilterFactory, TestBrazilianStemFilterFactory, PrimitiveFieldTypeTest, TestMultiWordSynonyms, DirectUpdateHandlerTest, TestSort, TestLuceneMatchVersion, XmlUpdateRequestHandlerTest, RequiredFieldsTest, DistanceFunctionTest, TestWriterPerf, FullSolrCloudDistribCmdsTest, SpellPossibilityIteratorTest, PeerSyncTest, TestDFRSimilarityFactory, ResourceLoaderTest, SpellingQueryConverterTest, TestPatternTokenizerFactory, IndexSchemaTest, TestIndonesianStemFilterFactory, TestJapanesePartOfSpeechStopFilterFactory, RecoveryZkTest, LeaderElectionIntegrationTest, DistributedSpellCheckComponentTest, QueryElevationComponentTest, TestMultiCoreConfBootstrap, TestFunctionQuery, DistributedQueryElevationComponentTest, SuggesterFSTTest, SolrCmdDistributorTest, TestCoreContainer, TermsComponentTest, HighlighterTest, SortByFunctionTest, SuggesterTSTTest]
[junit4] 2>
[junit4] Completed in 2.32s, 4 tests, 1 error <<< FAILURES!
[junit4]
[junit4] Suite: org.apache.solr.search.SpatialFilterTest
[junit4] Completed in 2.84s, 3 tests
[junit4]
[junit4] Suite: org.apache.solr.schema.TestOmitPositions
[junit4] Completed in 1.88s, 2 tests
[junit4]
[junit4] Suite: org.apache.solr.update.SolrIndexConfigTest
[junit4] Completed in 1.96s, 2 tests
[junit4]
[junit4] Suite: org.apache.solr.search.TestQueryTypes
[junit4] Completed in 1.40s, 1 test
[junit4]
[junit4] Suite: org.apache.solr.spelling.FileBasedSpellCheckerTest
[junit4] Completed in 1.23s, 3 tests
[junit4]
[junit4] Suite: org.apache.solr.search.TestIndexSearcher
[junit4] Completed in 2.63s, 2 tests
[junit4]
[junit4] Suite: org.apache.solr.search.TestQueryUtils
[junit4] Completed in 1.97s, 1 test
[junit4]
[junit4] Suite: org.apache.solr.handler.component.BadComponentTest
[junit4] Completed in 0.87s, 1 test
[junit4]
[junit4] Suite: org.apache.solr.handler.JsonLoaderTest
[junit4] Completed in 1.00s, 5 tests
[junit4]
[junit4] Suite: org.apache.solr.response.TestCSVResponseWriter
[junit4] Completed in 1.04s, 1 test
[junit4]
[junit4] Suite: org.apache.solr.core.IndexReaderFactoryTest
[junit4] Completed in 0.85s, 1 test
[junit4]
[junit4] Suite: org.apache.solr.handler.BinaryUpdateRequestHandlerTest
[junit4] Completed in 1.02s, 1 test
[junit4]
[junit4] Suite: org.apache.solr.schema.TestCollationField
[junit4] Completed in 0.39s, 8 tests
[junit4]
[junit4] Suite: org.apache.solr.search.QueryParsingTest
[junit4] Completed in 1.04s, 3 tests
[junit4]
[junit4] Suite: org.apache.solr.handler.component.SearchHandlerTest
[junit4] Completed in 0.92s, 1 test
[junit4]
[junit4] Suite: org.apache.solr.schema.MultiTermTest
[junit4] Completed in 0.52s, 3 tests
[junit4]
[junit4] Suite: org.apache.solr.search.ReturnFieldsTest
[junit4] Completed in 1.12s, 10 tests
[junit4]
[junit4] Suite: org.apache.solr.core.TestQuerySenderNoQuery
[junit4] Completed in 0.93s, 3 tests
[junit4]
[junit4] Suite: org.apache.solr.core.SOLR749Test
[junit4] Completed in 1.07s, 1 test
[junit4]
[junit4] Suite: org.apache.solr.schema.NumericFieldsTest
[junit4] Completed in 0.69s, 1 test
[junit4]
[junit4] Suite: org.apache.solr.SampleTest
[junit4] Completed in 0.47s, 2 tests
[junit4]
[junit4] Suite: org.apache.solr.OutputWriterTest
[junit4] Completed in 0.31s, 5 tests
[junit4]
[junit4] Suite: org.apache.solr.analysis.TestJapaneseTokenizerFactory
[junit4] Completed in 0.03s, 4 tests
[junit4]
[junit4] Suite: org.apache.solr.spelling.suggest.TestPhraseSuggestions
[junit4] Completed in 0.22s, 1 test
[junit4]
[junit4] Suite: org.apache.solr.EchoParamsTest
[junit4] Completed in 0.28s, 1 test
[junit4]
[junit4] Suite: org.apache.solr.analysis.TestHyphenationCompoundWordTokenFilterFactory
[junit4] Completed in 0.25s, 2 tests
[junit4]
[junit4] Suite: org.apache.solr.search.similarities.TestLMJelinekMercerSimilarityFactory
[junit4] Completed in 0.23s, 2 tests
[junit4]
[junit4] Suite: org.apache.solr.TestPluginEnable
[junit4] Completed in 0.23s, 1 test
[junit4]
[junit4] Suite: org.apache.solr.update.processor.URLClassifyProcessorTest
[junit4] Completed in 0.06s, 7 tests
[junit4]
[junit4] Suite: org.apache.solr.core.PluginInfoTest
[junit4] Completed in 0.11s, 9 tests
[junit4]
[junit4] Suite: org.apache.solr.analysis.TestPortugueseMinimalStemFilterFactory
[junit4] Completed in 0.02s, 1 test
[junit4]
[junit4] Suite: org.apache.solr.analysis.TestSlowSynonymFilter
[junit4] Completed in 0.03s, 7 tests
[junit4]
[junit4] Suite: org.apache.solr.analysis.TestSynonymFilterFactory
[junit4] Completed in 0.02s, 4 tests
[junit4]
[junit4] Suite: org.apache.solr.analysis.TestCapitalizationFilterFactory
[junit4] Completed in 0.03s, 7 tests
[junit4]
[junit4] Suite: org.apache.solr.util.DOMUtilTest
[junit4] Completed in 0.03s, 1 test
[junit4]
[junit4] Suite: org.apache.solr.analysis.TestKeywordMarkerFilterFactory
[junit4] Completed in 0.02s, 2 tests
[junit4]
[junit4] Suite: org.apache.solr.analysis.TestWikipediaTokenizerFactory
[junit4] Completed in 0.02s, 1 test
[junit4]
[junit4] Suite: org.apache.solr.spelling.TestSuggestSpellingConverter
[junit4] Completed in 0.01s, 2 tests
[junit4]
[junit4] Suite: org.apache.solr.analysis.TestGreekStemFilterFactory
[junit4] Completed in 0.02s, 1 test
[junit4]
[junit4] Suite: org.apache.solr.analysis.TestKeepFilterFactory
[junit4] Completed in 0.02s, 1 test
[junit4]
[junit4] Suite: org.apache.solr.analysis.TestPatternReplaceFilterFactory
[junit4] Completed in 0.01s, 1 test
[junit4]
[junit4] Suite: org.apache.solr.analysis.TestPorterStemFilterFactory
[junit4] Completed in 0.01s, 1 test
[junit4]
[junit4] Suite: org.apache.solr.internal.csv.writer.CSVWriterTest
[junit4] Completed in 0.01s, 2 tests
[junit4]
[junit4] Suite: org.apache.solr.search.TestLRUCache
[junit4] Completed in 0.02s, 3 tests
[junit4]
[junit4] Suite: org.apache.solr.analysis.TestPersianNormalizationFilterFactory
[junit4] Completed in 0.01s, 1 test
[junit4]
[junit4] Suite: org.apache.solr.analysis.TestTrimFilterFactory
[junit4] Completed in 0.01s, 1 test
[junit4]
[junit4] Suite: org.apache.solr.analysis.TestTurkishLowerCaseFilterFactory
[junit4] Completed in 0.01s, 1 test
[junit4]
[junit4] Suite: org.apache.solr.analysis.TestBulgarianStemFilterFactory
[junit4] Completed in 0.01s, 1 test
[junit4]
[junit4] Suite: org.apache.solr.analysis.TestCJKWidthFilterFactory
[junit4] Completed in 0.01s, 1 test
[junit4]
[junit4] Suite: org.apache.solr.analysis.TestGreekLowerCaseFilterFactory
[junit4] Completed in 0.01s, 1 test
[junit4]
[junit4] Suite: org.apache.solr.analysis.TestItalianLightStemFilterFactory
[junit4] Completed in 0.01s, 1 test
[junit4]
[junit4] Suite: org.apache.solr.analysis.TestMappingCharFilterFactory
[junit4] Completed in 0.01s, 1 test
[junit4]
[junit4] Suite: org.apache.solr.analysis.TestRemoveDuplicatesTokenFilterFactory
[junit4] Completed in 0.01s, 1 test
[junit4]
[junit4] Suite: org.apache.solr.cloud.ChaosMonkeySafeLeaderTest
[junit4] Completed in 0.00s, 0 tests
[junit4]
[junit4] Suite: org.apache.solr.TestRandomFaceting
[junit4] Completed in 39.97s, 1 test
[junit4]
[junit4] Suite: org.apache.solr.handler.admin.LoggingHandlerTest
[junit4] Completed in 1.07s, 1 test
[junit4]
[junit4] Suite: org.apache.solr.util.TimeZoneUtilsTest
[junit4] Completed in 0.30s, 5 tests
[junit4]
[junit4] JVM J0: 0.94 .. 950.03 = 949.09s
[junit4] Execution time total: 15 minutes 50 seconds
[junit4] Tests summary: 286 suites, 972 tests, 1 error, 11 ignored (6 assumptions)

BUILD FAILED
<http://jenkins.sd-datasolutions.de/job/Lucene-Solr-trunk-Windows-Java7-64/ws/build.xml>:29: The following error occurred while executing this line:
<http://jenkins.sd-datasolutions.de/job/Lucene-Solr-trunk-Windows-Java7-64/ws/solr\build.xml>:144: The following error occurred while executing this line:
<http://jenkins.sd-datasolutions.de/job/Lucene-Solr-trunk-Windows-Java7-64/ws/lucene\module-build.xml>:62: The following error occurred while executing this line:
<http://jenkins.sd-datasolutions.de/job/Lucene-Solr-trunk-Windows-Java7-64/ws/lucene\common-build.xml>:1019: The following error occurred while executing this line:
<http://jenkins.sd-datasolutions.de/job/Lucene-Solr-trunk-Windows-Java7-64/ws/lucene\common-build.xml>:745: There were test failures: 286 suites, 972 tests, 1 error, 11 ignored (6 assumptions)

Total time: 33 minutes 59 seconds
Build step 'Invoke Ant' marked build as failure
Recording test results

---------------------------------------------------------------------
To unsubscribe, e-mail: dev-unsubscribe [at] lucene
For additional commands, e-mail: dev-help [at] lucene

Lucene java-dev RSS feed   Index | Next | Previous | View Threaded
 
 


Interested in having your list archived? Contact Gossamer Threads
 
  Web Applications & Managed Hosting Powered by Gossamer Threads Inc.