Login | Register For Free | Help
Search for: (Advanced)

Mailing List Archive: Lucene: Java-Dev

[JENKINS] Solr-trunk - Build # 1818 - Still Failing

 

 

Lucene java-dev RSS feed   Index | Next | Previous | View Threaded


jenkins at builds

Apr 8, 2012, 8:55 AM

Post #1 of 1 (78 views)
Permalink
[JENKINS] Solr-trunk - Build # 1818 - Still Failing

Build: https://builds.apache.org/job/Solr-trunk/1818/

1 tests failed.
FAILED: org.apache.solr.TestDistributedSearch.testDistribSearch

Error Message:
Uncaught exception by thread: Thread[Thread-734,5,]

Stack Trace:
org.apache.lucene.util.UncaughtExceptionsRule$UncaughtExceptionsInBackgroundThread: Uncaught exception by thread: Thread[Thread-734,5,]
at org.apache.lucene.util.UncaughtExceptionsRule$1.evaluate(UncaughtExceptionsRule.java:84)
at org.apache.lucene.util.LuceneTestCase$SaveThreadAndTestNameRule$1.evaluate(LuceneTestCase.java:642)
at org.junit.rules.RunRules.evaluate(RunRules.java:18)
at org.junit.runners.ParentRunner.runLeaf(ParentRunner.java:263)
at org.junit.runners.BlockJUnit4ClassRunner.runChild(BlockJUnit4ClassRunner.java:68)
at org.apache.lucene.util.LuceneTestCaseRunner.runChild(LuceneTestCaseRunner.java:164)
at org.apache.lucene.util.LuceneTestCaseRunner.runChild(LuceneTestCaseRunner.java:57)
at org.junit.runners.ParentRunner$3.run(ParentRunner.java:231)
at org.junit.runners.ParentRunner$1.schedule(ParentRunner.java:60)
at org.junit.runners.ParentRunner.runChildren(ParentRunner.java:229)
at org.junit.runners.ParentRunner.access$000(ParentRunner.java:50)
at org.junit.runners.ParentRunner$2.evaluate(ParentRunner.java:222)
at org.junit.internal.runners.statements.RunBefores.evaluate(RunBefores.java:28)
at org.junit.internal.runners.statements.RunAfters.evaluate(RunAfters.java:30)
at org.apache.lucene.util.SystemPropertiesRestoreRule$1.evaluate(SystemPropertiesRestoreRule.java:63)
at org.apache.lucene.util.UncaughtExceptionsRule$1.evaluate(UncaughtExceptionsRule.java:75)
at org.apache.lucene.util.StoreClassNameRule$1.evaluate(StoreClassNameRule.java:38)
at org.apache.lucene.util.SystemPropertiesInvariantRule$1.evaluate(SystemPropertiesInvariantRule.java:69)
at org.junit.rules.RunRules.evaluate(RunRules.java:18)
at org.junit.runners.ParentRunner.run(ParentRunner.java:300)
at junit.framework.JUnit4TestAdapter.run(JUnit4TestAdapter.java:39)
at org.apache.tools.ant.taskdefs.optional.junit.JUnitTestRunner.run(JUnitTestRunner.java:420)
at org.apache.tools.ant.taskdefs.optional.junit.JUnitTestRunner.launch(JUnitTestRunner.java:911)
at org.apache.tools.ant.taskdefs.optional.junit.JUnitTestRunner.main(JUnitTestRunner.java:743)
Caused by: java.lang.RuntimeException: org.apache.solr.client.solrj.SolrServerException: IOException occured when talking to server at: http://localhost:64451/solr
at org.apache.solr.TestDistributedSearch$1.run(TestDistributedSearch.java:396)
Caused by: org.apache.solr.client.solrj.SolrServerException: IOException occured when talking to server at: http://localhost:64451/solr
at org.apache.solr.client.solrj.impl.HttpSolrServer.request(HttpSolrServer.java:361)
at org.apache.solr.client.solrj.impl.HttpSolrServer.request(HttpSolrServer.java:209)
at org.apache.solr.client.solrj.request.QueryRequest.process(QueryRequest.java:90)
at org.apache.solr.client.solrj.SolrServer.query(SolrServer.java:312)
at org.apache.solr.TestDistributedSearch$1.run(TestDistributedSearch.java:391)
Caused by: org.apache.http.conn.ConnectTimeoutException: Connect to localhost:64451 timed out
at org.apache.http.conn.scheme.PlainSocketFactory.connectSocket(PlainSocketFactory.java:125)
at org.apache.http.impl.conn.DefaultClientConnectionOperator.openConnection(DefaultClientConnectionOperator.java:148)
at org.apache.http.impl.conn.AbstractPoolEntry.open(AbstractPoolEntry.java:150)
at org.apache.http.impl.conn.AbstractPooledConnAdapter.open(AbstractPooledConnAdapter.java:121)
at org.apache.http.impl.client.DefaultRequestDirector.tryConnect(DefaultRequestDirector.java:575)
at org.apache.http.impl.client.DefaultRequestDirector.execute(DefaultRequestDirector.java:425)
at org.apache.http.impl.client.AbstractHttpClient.execute(AbstractHttpClient.java:820)
at org.apache.http.impl.client.AbstractHttpClient.execute(AbstractHttpClient.java:754)
at org.apache.http.impl.client.AbstractHttpClient.execute(AbstractHttpClient.java:732)
at org.apache.solr.client.solrj.impl.HttpSolrServer.request(HttpSolrServer.java:304)
... 4 more




Build Log (for compile errors):
[...truncated 10621 lines...]

Lucene java-dev RSS feed   Index | Next | Previous | View Threaded
 
 


Interested in having your list archived? Contact Gossamer Threads
 
  Web Applications & Managed Hosting Powered by Gossamer Threads Inc.