Login | Register For Free | Help
Search for: (Advanced)

Mailing List Archive: Zope: CMF

cmf-tests - OK: 3, UNKNOWN: 1

 

 

Zope cmf RSS feed   Index | Next | Previous | View Threaded


noreply at zope

Jul 4, 2011, 10:00 PM

Post #1 of 75 (5070 views)
Permalink
cmf-tests - OK: 3, UNKNOWN: 1

This is the summary for test reports received on the
cmf-tests list between 2011-07-03 00:00:00 UTC and 2011-07-04 00:00:00 UTC:

See the footnotes for test reports of unsuccessful builds.

An up-to date view of the builders is also available in our
buildbot documentation:
http://docs.zope.org/zopetoolkit/process/buildbots.html#the-nightly-builds

Reports received
----------------

CMF-2.2 Zope-2.12 Python-2.6.6 : Linux
CMF-2.2 Zope-2.13 Python-2.6.6 : Linux
CMF-trunk Zope-2.13 Python-2.6.6 : Linux
[1] FAILED (failures=1, errors=4) : CMF-trunk Zope-trunk Python-2.6.6 : Linux

Non-OK results
--------------

[1] UNKNOWN FAILED (failures=1, errors=4) : CMF-trunk Zope-trunk Python-2.6.6 : Linux
https://mail.zope.org/pipermail/cmf-tests/2011-July/014957.html


_______________________________________________
Zope-CMF maillist - Zope-CMF [at] zope
https://mail.zope.org/mailman/listinfo/zope-cmf

See https://bugs.launchpad.net/zope-cmf/ for bug reports and feature requests


charlie.clark at clark-consulting

Jul 5, 2011, 3:44 AM

Post #2 of 75 (5032 views)
Permalink
Re: cmf-tests - OK: 3, UNKNOWN: 1 [In reply to]

Am 05.07.2011, 07:00 Uhr, schrieb CMF tests summarizer <noreply [at] zope>:

> [1] UNKNOWN FAILED (failures=1, errors=4) : CMF-trunk Zope-trunk
> Python-2.6.6 : Linux
> https://mail.zope.org/pipermail/cmf-tests/2011-July/014957.html

All errors are related to FSMetaData

Error in test test_basicPermissions
(Products.CMFCore.tests.test_FSMetadata.FSMetadata)
Traceback (most recent call last):
File "/usr/local/python2.6/lib/python2.6/unittest.py", line 279, in run
testMethod()
File
"/home/stefan/autotest/temp/python26-zope214-cmf23/src/Products.CMFCore/Products/CMFCore/tests/test_FSMetadata.py",
line 43, in test_basicPermissions
['Manager','Anonymous'])
File
"/home/stefan/autotest/temp/python26-zope214-cmf23/src/Products.CMFCore/Products/CMFCore/tests/test_FSSecurity.py",
line 51, in _checkSettings
% permissionname)
ValueError: 'Access contents information' not found in inherited
permissions.

--
Charlie Clark
Managing Director
Clark Consulting & Research
German Office
Helmholtzstr. 20
Düsseldorf
D- 40215
Tel: +49-211-600-3657
Mobile: +49-178-782-6226
_______________________________________________
Zope-CMF maillist - Zope-CMF [at] zope
https://mail.zope.org/mailman/listinfo/zope-cmf

See https://bugs.launchpad.net/zope-cmf/ for bug reports and feature requests


hanno at hannosch

Jul 5, 2011, 3:53 AM

Post #3 of 75 (5039 views)
Permalink
Re: cmf-tests - OK: 3, UNKNOWN: 1 [In reply to]

On Tue, Jul 5, 2011 at 12:44 PM, Charlie Clark
<charlie.clark [at] clark-consulting> wrote:
> Am 05.07.2011, 07:00 Uhr, schrieb CMF tests summarizer <noreply [at] zope>:
>
>> [1]    UNKNOWN FAILED (failures=1, errors=4) : CMF-trunk Zope-trunk
>> Python-2.6.6 : Linux
>>        https://mail.zope.org/pipermail/cmf-tests/2011-July/014957.html
>
> All errors are related to FSMetaData
>
> Error in test test_basicPermissions
> (Products.CMFCore.tests.test_FSMetadata.FSMetadata)
> Traceback (most recent call last):
>   File "/usr/local/python2.6/lib/python2.6/unittest.py", line 279, in run
>     testMethod()
>   File
> "/home/stefan/autotest/temp/python26-zope214-cmf23/src/Products.CMFCore/Products/CMFCore/tests/test_FSMetadata.py",
> line 43, in test_basicPermissions
>     ['Manager','Anonymous'])
>   File
> "/home/stefan/autotest/temp/python26-zope214-cmf23/src/Products.CMFCore/Products/CMFCore/tests/test_FSSecurity.py",
> line 51, in _checkSettings
>     % permissionname)
> ValueError: 'Access contents information' not found in inherited
> permissions.

Yes, these are my fault. I kept testing the CMF against Zope trunk for
the most part of the weekend, but didn't run the tests anymore for the
last round of changes.

Not sure what exactly caused these, but I'll have a look.

Hanno
_______________________________________________
Zope-CMF maillist - Zope-CMF [at] zope
https://mail.zope.org/mailman/listinfo/zope-cmf

See https://bugs.launchpad.net/zope-cmf/ for bug reports and feature requests


noreply at zope

Jul 5, 2011, 10:00 PM

Post #4 of 75 (5026 views)
Permalink
cmf-tests - OK: 3, UNKNOWN: 1 [In reply to]

This is the summary for test reports received on the
cmf-tests list between 2011-07-04 00:00:00 UTC and 2011-07-05 00:00:00 UTC:

See the footnotes for test reports of unsuccessful builds.

An up-to date view of the builders is also available in our
buildbot documentation:
http://docs.zope.org/zopetoolkit/process/buildbots.html#the-nightly-builds

Reports received
----------------

CMF-2.2 Zope-2.12 Python-2.6.6 : Linux
CMF-2.2 Zope-2.13 Python-2.6.6 : Linux
CMF-trunk Zope-2.13 Python-2.6.6 : Linux
[1] FAILED (failures=1, errors=4) : CMF-trunk Zope-trunk Python-2.6.6 : Linux

Non-OK results
--------------

[1] UNKNOWN FAILED (failures=1, errors=4) : CMF-trunk Zope-trunk Python-2.6.6 : Linux
https://mail.zope.org/pipermail/cmf-tests/2011-July/014961.html


_______________________________________________
Zope-CMF maillist - Zope-CMF [at] zope
https://mail.zope.org/mailman/listinfo/zope-cmf

See https://bugs.launchpad.net/zope-cmf/ for bug reports and feature requests


noreply at zope

Jul 6, 2011, 10:00 PM

Post #5 of 75 (5026 views)
Permalink
cmf-tests - OK: 3, UNKNOWN: 1 [In reply to]

This is the summary for test reports received on the
cmf-tests list between 2011-07-05 00:00:00 UTC and 2011-07-06 00:00:00 UTC:

See the footnotes for test reports of unsuccessful builds.

An up-to date view of the builders is also available in our
buildbot documentation:
http://docs.zope.org/zopetoolkit/process/buildbots.html#the-nightly-builds

Reports received
----------------

CMF-2.2 Zope-2.12 Python-2.6.6 : Linux
CMF-2.2 Zope-2.13 Python-2.6.6 : Linux
CMF-trunk Zope-2.13 Python-2.6.6 : Linux
[1] FAILED (failures=1, errors=4) : CMF-trunk Zope-trunk Python-2.6.6 : Linux

Non-OK results
--------------

[1] UNKNOWN FAILED (failures=1, errors=4) : CMF-trunk Zope-trunk Python-2.6.6 : Linux
https://mail.zope.org/pipermail/cmf-tests/2011-July/014965.html


_______________________________________________
Zope-CMF maillist - Zope-CMF [at] zope
https://mail.zope.org/mailman/listinfo/zope-cmf

See https://bugs.launchpad.net/zope-cmf/ for bug reports and feature requests


noreply at zope

Jul 7, 2011, 10:00 PM

Post #6 of 75 (5019 views)
Permalink
cmf-tests - OK: 3, UNKNOWN: 1 [In reply to]

This is the summary for test reports received on the
cmf-tests list between 2011-07-06 00:00:00 UTC and 2011-07-07 00:00:00 UTC:

See the footnotes for test reports of unsuccessful builds.

An up-to date view of the builders is also available in our
buildbot documentation:
http://docs.zope.org/zopetoolkit/process/buildbots.html#the-nightly-builds

Reports received
----------------

CMF-2.2 Zope-2.12 Python-2.6.6 : Linux
CMF-2.2 Zope-2.13 Python-2.6.6 : Linux
CMF-trunk Zope-2.13 Python-2.6.6 : Linux
[1] FAILED (failures=1, errors=4) : CMF-trunk Zope-trunk Python-2.6.6 : Linux

Non-OK results
--------------

[1] UNKNOWN FAILED (failures=1, errors=4) : CMF-trunk Zope-trunk Python-2.6.6 : Linux
https://mail.zope.org/pipermail/cmf-tests/2011-July/014969.html


_______________________________________________
Zope-CMF maillist - Zope-CMF [at] zope
https://mail.zope.org/mailman/listinfo/zope-cmf

See https://bugs.launchpad.net/zope-cmf/ for bug reports and feature requests


noreply at zope

Jul 8, 2011, 10:00 PM

Post #7 of 75 (5015 views)
Permalink
cmf-tests - OK: 3, UNKNOWN: 1 [In reply to]

This is the summary for test reports received on the
cmf-tests list between 2011-07-07 00:00:00 UTC and 2011-07-08 00:00:00 UTC:

See the footnotes for test reports of unsuccessful builds.

An up-to date view of the builders is also available in our
buildbot documentation:
http://docs.zope.org/zopetoolkit/process/buildbots.html#the-nightly-builds

Reports received
----------------

CMF-2.2 Zope-2.12 Python-2.6.6 : Linux
CMF-2.2 Zope-2.13 Python-2.6.6 : Linux
CMF-trunk Zope-2.13 Python-2.6.6 : Linux
[1] FAILED (failures=1, errors=4) : CMF-trunk Zope-trunk Python-2.6.6 : Linux

Non-OK results
--------------

[1] UNKNOWN FAILED (failures=1, errors=4) : CMF-trunk Zope-trunk Python-2.6.6 : Linux
https://mail.zope.org/pipermail/cmf-tests/2011-July/014973.html


_______________________________________________
Zope-CMF maillist - Zope-CMF [at] zope
https://mail.zope.org/mailman/listinfo/zope-cmf

See https://bugs.launchpad.net/zope-cmf/ for bug reports and feature requests


noreply at zope

Jul 9, 2011, 10:00 PM

Post #8 of 75 (5004 views)
Permalink
cmf-tests - OK: 3, UNKNOWN: 1 [In reply to]

This is the summary for test reports received on the
cmf-tests list between 2011-07-08 00:00:00 UTC and 2011-07-09 00:00:00 UTC:

See the footnotes for test reports of unsuccessful builds.

An up-to date view of the builders is also available in our
buildbot documentation:
http://docs.zope.org/zopetoolkit/process/buildbots.html#the-nightly-builds

Reports received
----------------

CMF-2.2 Zope-2.12 Python-2.6.6 : Linux
CMF-2.2 Zope-2.13 Python-2.6.6 : Linux
CMF-trunk Zope-2.13 Python-2.6.6 : Linux
[1] FAILED (failures=1, errors=4) : CMF-trunk Zope-trunk Python-2.6.6 : Linux

Non-OK results
--------------

[1] UNKNOWN FAILED (failures=1, errors=4) : CMF-trunk Zope-trunk Python-2.6.6 : Linux
https://mail.zope.org/pipermail/cmf-tests/2011-July/014977.html


_______________________________________________
Zope-CMF maillist - Zope-CMF [at] zope
https://mail.zope.org/mailman/listinfo/zope-cmf

See https://bugs.launchpad.net/zope-cmf/ for bug reports and feature requests


noreply at zope

Jul 10, 2011, 10:00 PM

Post #9 of 75 (4987 views)
Permalink
cmf-tests - OK: 3, UNKNOWN: 1 [In reply to]

This is the summary for test reports received on the
cmf-tests list between 2011-07-09 00:00:00 UTC and 2011-07-10 00:00:00 UTC:

See the footnotes for test reports of unsuccessful builds.

An up-to date view of the builders is also available in our
buildbot documentation:
http://docs.zope.org/zopetoolkit/process/buildbots.html#the-nightly-builds

Reports received
----------------

CMF-2.2 Zope-2.12 Python-2.6.6 : Linux
CMF-2.2 Zope-2.13 Python-2.6.6 : Linux
CMF-trunk Zope-2.13 Python-2.6.6 : Linux
[1] FAILED (failures=1, errors=4) : CMF-trunk Zope-trunk Python-2.6.6 : Linux

Non-OK results
--------------

[1] UNKNOWN FAILED (failures=1, errors=4) : CMF-trunk Zope-trunk Python-2.6.6 : Linux
https://mail.zope.org/pipermail/cmf-tests/2011-July/014981.html


_______________________________________________
Zope-CMF maillist - Zope-CMF [at] zope
https://mail.zope.org/mailman/listinfo/zope-cmf

See https://bugs.launchpad.net/zope-cmf/ for bug reports and feature requests


noreply at zope

Jul 11, 2011, 10:00 PM

Post #10 of 75 (4971 views)
Permalink
cmf-tests - OK: 3, UNKNOWN: 1 [In reply to]

This is the summary for test reports received on the
cmf-tests list between 2011-07-10 00:00:00 UTC and 2011-07-11 00:00:00 UTC:

See the footnotes for test reports of unsuccessful builds.

An up-to date view of the builders is also available in our
buildbot documentation:
http://docs.zope.org/zopetoolkit/process/buildbots.html#the-nightly-builds

Reports received
----------------

CMF-2.2 Zope-2.12 Python-2.6.6 : Linux
CMF-2.2 Zope-2.13 Python-2.6.6 : Linux
CMF-trunk Zope-2.13 Python-2.6.6 : Linux
[1] FAILED (failures=1, errors=4) : CMF-trunk Zope-trunk Python-2.6.6 : Linux

Non-OK results
--------------

[1] UNKNOWN FAILED (failures=1, errors=4) : CMF-trunk Zope-trunk Python-2.6.6 : Linux
https://mail.zope.org/pipermail/cmf-tests/2011-July/014985.html


_______________________________________________
Zope-CMF maillist - Zope-CMF [at] zope
https://mail.zope.org/mailman/listinfo/zope-cmf

See https://bugs.launchpad.net/zope-cmf/ for bug reports and feature requests


noreply at zope

Jul 12, 2011, 10:00 PM

Post #11 of 75 (4952 views)
Permalink
cmf-tests - OK: 3, UNKNOWN: 1 [In reply to]

This is the summary for test reports received on the
cmf-tests list between 2011-07-11 00:00:00 UTC and 2011-07-12 00:00:00 UTC:

See the footnotes for test reports of unsuccessful builds.

An up-to date view of the builders is also available in our
buildbot documentation:
http://docs.zope.org/zopetoolkit/process/buildbots.html#the-nightly-builds

Reports received
----------------

CMF-2.2 Zope-2.12 Python-2.6.6 : Linux
CMF-2.2 Zope-2.13 Python-2.6.6 : Linux
CMF-trunk Zope-2.13 Python-2.6.6 : Linux
[1] FAILED (failures=1, errors=4) : CMF-trunk Zope-trunk Python-2.6.6 : Linux

Non-OK results
--------------

[1] UNKNOWN FAILED (failures=1, errors=4) : CMF-trunk Zope-trunk Python-2.6.6 : Linux
https://mail.zope.org/pipermail/cmf-tests/2011-July/014989.html


_______________________________________________
Zope-CMF maillist - Zope-CMF [at] zope
https://mail.zope.org/mailman/listinfo/zope-cmf

See https://bugs.launchpad.net/zope-cmf/ for bug reports and feature requests


noreply at zope

Jul 13, 2011, 10:00 PM

Post #12 of 75 (4943 views)
Permalink
cmf-tests - OK: 3, UNKNOWN: 1 [In reply to]

This is the summary for test reports received on the
cmf-tests list between 2011-07-12 00:00:00 UTC and 2011-07-13 00:00:00 UTC:

See the footnotes for test reports of unsuccessful builds.

An up-to date view of the builders is also available in our
buildbot documentation:
http://docs.zope.org/zopetoolkit/process/buildbots.html#the-nightly-builds

Reports received
----------------

CMF-2.2 Zope-2.12 Python-2.6.6 : Linux
CMF-2.2 Zope-2.13 Python-2.6.6 : Linux
CMF-trunk Zope-2.13 Python-2.6.6 : Linux
[1] FAILED (failures=1, errors=4) : CMF-trunk Zope-trunk Python-2.6.6 : Linux

Non-OK results
--------------

[1] UNKNOWN FAILED (failures=1, errors=4) : CMF-trunk Zope-trunk Python-2.6.6 : Linux
https://mail.zope.org/pipermail/cmf-tests/2011-July/014993.html


_______________________________________________
Zope-CMF maillist - Zope-CMF [at] zope
https://mail.zope.org/mailman/listinfo/zope-cmf

See https://bugs.launchpad.net/zope-cmf/ for bug reports and feature requests


noreply at zope

Jul 14, 2011, 10:00 PM

Post #13 of 75 (4931 views)
Permalink
cmf-tests - OK: 3, UNKNOWN: 1 [In reply to]

This is the summary for test reports received on the
cmf-tests list between 2011-07-13 00:00:00 UTC and 2011-07-14 00:00:00 UTC:

See the footnotes for test reports of unsuccessful builds.

An up-to date view of the builders is also available in our
buildbot documentation:
http://docs.zope.org/zopetoolkit/process/buildbots.html#the-nightly-builds

Reports received
----------------

CMF-2.2 Zope-2.12 Python-2.6.6 : Linux
CMF-2.2 Zope-2.13 Python-2.6.6 : Linux
CMF-trunk Zope-2.13 Python-2.6.6 : Linux
[1] FAILED (failures=3, errors=4) : CMF-trunk Zope-trunk Python-2.6.6 : Linux

Non-OK results
--------------

[1] UNKNOWN FAILED (failures=3, errors=4) : CMF-trunk Zope-trunk Python-2.6.6 : Linux
https://mail.zope.org/pipermail/cmf-tests/2011-July/014997.html


_______________________________________________
Zope-CMF maillist - Zope-CMF [at] zope
https://mail.zope.org/mailman/listinfo/zope-cmf

See https://bugs.launchpad.net/zope-cmf/ for bug reports and feature requests


noreply at zope

Jul 15, 2011, 10:00 PM

Post #14 of 75 (4912 views)
Permalink
cmf-tests - OK: 3, UNKNOWN: 1 [In reply to]

This is the summary for test reports received on the
cmf-tests list between 2011-07-14 00:00:00 UTC and 2011-07-15 00:00:00 UTC:

See the footnotes for test reports of unsuccessful builds.

An up-to date view of the builders is also available in our
buildbot documentation:
http://docs.zope.org/zopetoolkit/process/buildbots.html#the-nightly-builds

Reports received
----------------

CMF-2.2 Zope-2.12 Python-2.6.6 : Linux
CMF-2.2 Zope-2.13 Python-2.6.6 : Linux
CMF-trunk Zope-2.13 Python-2.6.6 : Linux
[1] FAILED (failures=5, errors=4) : CMF-trunk Zope-trunk Python-2.6.6 : Linux

Non-OK results
--------------

[1] UNKNOWN FAILED (failures=5, errors=4) : CMF-trunk Zope-trunk Python-2.6.6 : Linux
https://mail.zope.org/pipermail/cmf-tests/2011-July/015001.html


_______________________________________________
Zope-CMF maillist - Zope-CMF [at] zope
https://mail.zope.org/mailman/listinfo/zope-cmf

See https://bugs.launchpad.net/zope-cmf/ for bug reports and feature requests


noreply at zope

Jul 16, 2011, 10:00 PM

Post #15 of 75 (4911 views)
Permalink
cmf-tests - OK: 3, UNKNOWN: 1 [In reply to]

This is the summary for test reports received on the
cmf-tests list between 2011-07-15 00:00:00 UTC and 2011-07-16 00:00:00 UTC:

See the footnotes for test reports of unsuccessful builds.

An up-to date view of the builders is also available in our
buildbot documentation:
http://docs.zope.org/zopetoolkit/process/buildbots.html#the-nightly-builds

Reports received
----------------

CMF-2.2 Zope-2.12 Python-2.6.6 : Linux
CMF-2.2 Zope-2.13 Python-2.6.6 : Linux
CMF-trunk Zope-2.13 Python-2.6.6 : Linux
[1] FAILED (failures=5, errors=4) : CMF-trunk Zope-trunk Python-2.6.6 : Linux

Non-OK results
--------------

[1] UNKNOWN FAILED (failures=5, errors=4) : CMF-trunk Zope-trunk Python-2.6.6 : Linux
https://mail.zope.org/pipermail/cmf-tests/2011-July/015005.html


_______________________________________________
Zope-CMF maillist - Zope-CMF [at] zope
https://mail.zope.org/mailman/listinfo/zope-cmf

See https://bugs.launchpad.net/zope-cmf/ for bug reports and feature requests


noreply at zope

Jul 17, 2011, 10:00 PM

Post #16 of 75 (4893 views)
Permalink
cmf-tests - OK: 3, UNKNOWN: 1 [In reply to]

This is the summary for test reports received on the
cmf-tests list between 2011-07-16 00:00:00 UTC and 2011-07-17 00:00:00 UTC:

See the footnotes for test reports of unsuccessful builds.

An up-to date view of the builders is also available in our
buildbot documentation:
http://docs.zope.org/zopetoolkit/process/buildbots.html#the-nightly-builds

Reports received
----------------

CMF-2.2 Zope-2.12 Python-2.6.6 : Linux
CMF-2.2 Zope-2.13 Python-2.6.6 : Linux
CMF-trunk Zope-2.13 Python-2.6.6 : Linux
[1] FAILED (failures=5, errors=4) : CMF-trunk Zope-trunk Python-2.6.6 : Linux

Non-OK results
--------------

[1] UNKNOWN FAILED (failures=5, errors=4) : CMF-trunk Zope-trunk Python-2.6.6 : Linux
https://mail.zope.org/pipermail/cmf-tests/2011-July/015009.html


_______________________________________________
Zope-CMF maillist - Zope-CMF [at] zope
https://mail.zope.org/mailman/listinfo/zope-cmf

See https://bugs.launchpad.net/zope-cmf/ for bug reports and feature requests


noreply at zope

Jul 18, 2011, 10:00 PM

Post #17 of 75 (4870 views)
Permalink
cmf-tests - OK: 3, UNKNOWN: 1 [In reply to]

This is the summary for test reports received on the
cmf-tests list between 2011-07-17 00:00:00 UTC and 2011-07-18 00:00:00 UTC:

See the footnotes for test reports of unsuccessful builds.

An up-to date view of the builders is also available in our
buildbot documentation:
http://docs.zope.org/zopetoolkit/process/buildbots.html#the-nightly-builds

Reports received
----------------

CMF-2.2 Zope-2.12 Python-2.6.6 : Linux
CMF-2.2 Zope-2.13 Python-2.6.6 : Linux
CMF-trunk Zope-2.13 Python-2.6.6 : Linux
[1] FAILED (failures=3, errors=4) : CMF-trunk Zope-trunk Python-2.6.6 : Linux

Non-OK results
--------------

[1] UNKNOWN FAILED (failures=3, errors=4) : CMF-trunk Zope-trunk Python-2.6.6 : Linux
https://mail.zope.org/pipermail/cmf-tests/2011-July/015013.html


_______________________________________________
Zope-CMF maillist - Zope-CMF [at] zope
https://mail.zope.org/mailman/listinfo/zope-cmf

See https://bugs.launchpad.net/zope-cmf/ for bug reports and feature requests


noreply at zope

Jul 19, 2011, 10:00 PM

Post #18 of 75 (4858 views)
Permalink
cmf-tests - OK: 3, UNKNOWN: 1 [In reply to]

This is the summary for test reports received on the
cmf-tests list between 2011-07-18 00:00:00 UTC and 2011-07-19 00:00:00 UTC:

See the footnotes for test reports of unsuccessful builds.

An up-to date view of the builders is also available in our
buildbot documentation:
http://docs.zope.org/zopetoolkit/process/buildbots.html#the-nightly-builds

Reports received
----------------

CMF-2.2 Zope-2.12 Python-2.6.6 : Linux
CMF-2.2 Zope-2.13 Python-2.6.6 : Linux
CMF-trunk Zope-2.13 Python-2.6.6 : Linux
[1] FAILED (failures=3, errors=4) : CMF-trunk Zope-trunk Python-2.6.6 : Linux

Non-OK results
--------------

[1] UNKNOWN FAILED (failures=3, errors=4) : CMF-trunk Zope-trunk Python-2.6.6 : Linux
https://mail.zope.org/pipermail/cmf-tests/2011-July/015017.html


_______________________________________________
Zope-CMF maillist - Zope-CMF [at] zope
https://mail.zope.org/mailman/listinfo/zope-cmf

See https://bugs.launchpad.net/zope-cmf/ for bug reports and feature requests


noreply at zope

Jul 20, 2011, 10:00 PM

Post #19 of 75 (4849 views)
Permalink
cmf-tests - OK: 3, UNKNOWN: 1 [In reply to]

This is the summary for test reports received on the
cmf-tests list between 2011-07-19 00:00:00 UTC and 2011-07-20 00:00:00 UTC:

See the footnotes for test reports of unsuccessful builds.

An up-to date view of the builders is also available in our
buildbot documentation:
http://docs.zope.org/zopetoolkit/process/buildbots.html#the-nightly-builds

Reports received
----------------

CMF-2.2 Zope-2.12 Python-2.6.6 : Linux
CMF-2.2 Zope-2.13 Python-2.6.6 : Linux
CMF-trunk Zope-2.13 Python-2.6.6 : Linux
[1] FAILED (failures=3, errors=4) : CMF-trunk Zope-trunk Python-2.6.6 : Linux

Non-OK results
--------------

[1] UNKNOWN FAILED (failures=3, errors=4) : CMF-trunk Zope-trunk Python-2.6.6 : Linux
https://mail.zope.org/pipermail/cmf-tests/2011-July/015021.html


_______________________________________________
Zope-CMF maillist - Zope-CMF [at] zope
https://mail.zope.org/mailman/listinfo/zope-cmf

See https://bugs.launchpad.net/zope-cmf/ for bug reports and feature requests


noreply at zope

Jul 21, 2011, 10:00 PM

Post #20 of 75 (4835 views)
Permalink
cmf-tests - OK: 3, UNKNOWN: 1 [In reply to]

This is the summary for test reports received on the
cmf-tests list between 2011-07-20 00:00:00 UTC and 2011-07-21 00:00:00 UTC:

See the footnotes for test reports of unsuccessful builds.

An up-to date view of the builders is also available in our
buildbot documentation:
http://docs.zope.org/zopetoolkit/process/buildbots.html#the-nightly-builds

Reports received
----------------

CMF-2.2 Zope-2.12 Python-2.6.6 : Linux
CMF-2.2 Zope-2.13 Python-2.6.6 : Linux
CMF-trunk Zope-2.13 Python-2.6.6 : Linux
[1] FAILED (failures=3, errors=4) : CMF-trunk Zope-trunk Python-2.6.6 : Linux

Non-OK results
--------------

[1] UNKNOWN FAILED (failures=3, errors=4) : CMF-trunk Zope-trunk Python-2.6.6 : Linux
https://mail.zope.org/pipermail/cmf-tests/2011-July/015025.html


_______________________________________________
Zope-CMF maillist - Zope-CMF [at] zope
https://mail.zope.org/mailman/listinfo/zope-cmf

See https://bugs.launchpad.net/zope-cmf/ for bug reports and feature requests


noreply at zope

Jul 22, 2011, 10:00 PM

Post #21 of 75 (4804 views)
Permalink
cmf-tests - OK: 3, UNKNOWN: 1 [In reply to]

This is the summary for test reports received on the
cmf-tests list between 2011-07-21 00:00:00 UTC and 2011-07-22 00:00:00 UTC:

See the footnotes for test reports of unsuccessful builds.

An up-to date view of the builders is also available in our
buildbot documentation:
http://docs.zope.org/zopetoolkit/process/buildbots.html#the-nightly-builds

Reports received
----------------

CMF-2.2 Zope-2.12 Python-2.6.6 : Linux
CMF-2.2 Zope-2.13 Python-2.6.6 : Linux
CMF-trunk Zope-2.13 Python-2.6.6 : Linux
[1] FAILED (failures=3, errors=4) : CMF-trunk Zope-trunk Python-2.6.6 : Linux

Non-OK results
--------------

[1] UNKNOWN FAILED (failures=3, errors=4) : CMF-trunk Zope-trunk Python-2.6.6 : Linux
https://mail.zope.org/pipermail/cmf-tests/2011-July/015029.html


_______________________________________________
Zope-CMF maillist - Zope-CMF [at] zope
https://mail.zope.org/mailman/listinfo/zope-cmf

See https://bugs.launchpad.net/zope-cmf/ for bug reports and feature requests


noreply at zope

Jul 23, 2011, 10:00 PM

Post #22 of 75 (4787 views)
Permalink
cmf-tests - OK: 3, UNKNOWN: 1 [In reply to]

This is the summary for test reports received on the
cmf-tests list between 2011-07-22 00:00:00 UTC and 2011-07-23 00:00:00 UTC:

See the footnotes for test reports of unsuccessful builds.

An up-to date view of the builders is also available in our
buildbot documentation:
http://docs.zope.org/zopetoolkit/process/buildbots.html#the-nightly-builds

Reports received
----------------

CMF-2.2 Zope-2.12 Python-2.6.6 : Linux
CMF-2.2 Zope-2.13 Python-2.6.6 : Linux
CMF-trunk Zope-2.13 Python-2.6.6 : Linux
[1] FAILED (failures=3, errors=4) : CMF-trunk Zope-trunk Python-2.6.6 : Linux

Non-OK results
--------------

[1] UNKNOWN FAILED (failures=3, errors=4) : CMF-trunk Zope-trunk Python-2.6.6 : Linux
https://mail.zope.org/pipermail/cmf-tests/2011-July/015033.html


_______________________________________________
Zope-CMF maillist - Zope-CMF [at] zope
https://mail.zope.org/mailman/listinfo/zope-cmf

See https://bugs.launchpad.net/zope-cmf/ for bug reports and feature requests


noreply at zope

Jul 24, 2011, 10:00 PM

Post #23 of 75 (4771 views)
Permalink
cmf-tests - OK: 3, UNKNOWN: 1 [In reply to]

This is the summary for test reports received on the
cmf-tests list between 2011-07-23 00:00:00 UTC and 2011-07-24 00:00:00 UTC:

See the footnotes for test reports of unsuccessful builds.

An up-to date view of the builders is also available in our
buildbot documentation:
http://docs.zope.org/zopetoolkit/process/buildbots.html#the-nightly-builds

Reports received
----------------

CMF-2.2 Zope-2.12 Python-2.6.6 : Linux
CMF-2.2 Zope-2.13 Python-2.6.6 : Linux
CMF-trunk Zope-2.13 Python-2.6.6 : Linux
[1] FAILED (failures=3, errors=4) : CMF-trunk Zope-trunk Python-2.6.6 : Linux

Non-OK results
--------------

[1] UNKNOWN FAILED (failures=3, errors=4) : CMF-trunk Zope-trunk Python-2.6.6 : Linux
https://mail.zope.org/pipermail/cmf-tests/2011-July/015037.html


_______________________________________________
Zope-CMF maillist - Zope-CMF [at] zope
https://mail.zope.org/mailman/listinfo/zope-cmf

See https://bugs.launchpad.net/zope-cmf/ for bug reports and feature requests


noreply at zope

Jul 25, 2011, 10:00 PM

Post #24 of 75 (4752 views)
Permalink
cmf-tests - OK: 3, UNKNOWN: 1 [In reply to]

This is the summary for test reports received on the
cmf-tests list between 2011-07-24 00:00:00 UTC and 2011-07-25 00:00:00 UTC:

See the footnotes for test reports of unsuccessful builds.

An up-to date view of the builders is also available in our
buildbot documentation:
http://docs.zope.org/zopetoolkit/process/buildbots.html#the-nightly-builds

Reports received
----------------

CMF-2.2 Zope-2.12 Python-2.6.6 : Linux
CMF-2.2 Zope-2.13 Python-2.6.6 : Linux
CMF-trunk Zope-2.13 Python-2.6.6 : Linux
[1] FAILED (failures=3, errors=4) : CMF-trunk Zope-trunk Python-2.6.6 : Linux

Non-OK results
--------------

[1] UNKNOWN FAILED (failures=3, errors=4) : CMF-trunk Zope-trunk Python-2.6.6 : Linux
https://mail.zope.org/pipermail/cmf-tests/2011-July/015041.html


_______________________________________________
Zope-CMF maillist - Zope-CMF [at] zope
https://mail.zope.org/mailman/listinfo/zope-cmf

See https://bugs.launchpad.net/zope-cmf/ for bug reports and feature requests


noreply at zope

Jul 26, 2011, 10:00 PM

Post #25 of 75 (4732 views)
Permalink
cmf-tests - OK: 3, UNKNOWN: 1 [In reply to]

This is the summary for test reports received on the
cmf-tests list between 2011-07-25 00:00:00 UTC and 2011-07-26 00:00:00 UTC:

See the footnotes for test reports of unsuccessful builds.

An up-to date view of the builders is also available in our
buildbot documentation:
http://docs.zope.org/zopetoolkit/process/buildbots.html#the-nightly-builds

Reports received
----------------

CMF-2.2 Zope-2.12 Python-2.6.6 : Linux
CMF-2.2 Zope-2.13 Python-2.6.6 : Linux
CMF-trunk Zope-2.13 Python-2.6.6 : Linux
[1] FAILED (failures=3, errors=4) : CMF-trunk Zope-trunk Python-2.6.6 : Linux

Non-OK results
--------------

[1] UNKNOWN FAILED (failures=3, errors=4) : CMF-trunk Zope-trunk Python-2.6.6 : Linux
https://mail.zope.org/pipermail/cmf-tests/2011-July/015045.html


_______________________________________________
Zope-CMF maillist - Zope-CMF [at] zope
https://mail.zope.org/mailman/listinfo/zope-cmf

See https://bugs.launchpad.net/zope-cmf/ for bug reports and feature requests


noreply at zope

Jul 27, 2011, 10:00 PM

Post #26 of 75 (3834 views)
Permalink
cmf-tests - OK: 3, UNKNOWN: 1 [In reply to]

This is the summary for test reports received on the
cmf-tests list between 2011-07-26 00:00:00 UTC and 2011-07-27 00:00:00 UTC:

See the footnotes for test reports of unsuccessful builds.

An up-to date view of the builders is also available in our
buildbot documentation:
http://docs.zope.org/zopetoolkit/process/buildbots.html#the-nightly-builds

Reports received
----------------

CMF-2.2 Zope-2.12 Python-2.6.6 : Linux
CMF-2.2 Zope-2.13 Python-2.6.6 : Linux
CMF-trunk Zope-2.13 Python-2.6.6 : Linux
[1] FAILED (failures=3, errors=4) : CMF-trunk Zope-trunk Python-2.6.6 : Linux

Non-OK results
--------------

[1] UNKNOWN FAILED (failures=3, errors=4) : CMF-trunk Zope-trunk Python-2.6.6 : Linux
https://mail.zope.org/pipermail/cmf-tests/2011-July/015049.html


_______________________________________________
Zope-CMF maillist - Zope-CMF [at] zope
https://mail.zope.org/mailman/listinfo/zope-cmf

See https://bugs.launchpad.net/zope-cmf/ for bug reports and feature requests


noreply at zope

Jul 28, 2011, 10:00 PM

Post #27 of 75 (3833 views)
Permalink
cmf-tests - OK: 3, UNKNOWN: 1 [In reply to]

This is the summary for test reports received on the
cmf-tests list between 2011-07-27 00:00:00 UTC and 2011-07-28 00:00:00 UTC:

See the footnotes for test reports of unsuccessful builds.

An up-to date view of the builders is also available in our
buildbot documentation:
http://docs.zope.org/zopetoolkit/process/buildbots.html#the-nightly-builds

Reports received
----------------

CMF-2.2 Zope-2.12 Python-2.6.6 : Linux
CMF-2.2 Zope-2.13 Python-2.6.6 : Linux
CMF-trunk Zope-2.13 Python-2.6.6 : Linux
[1] FAILED (failures=3, errors=4) : CMF-trunk Zope-trunk Python-2.6.6 : Linux

Non-OK results
--------------

[1] UNKNOWN FAILED (failures=3, errors=4) : CMF-trunk Zope-trunk Python-2.6.6 : Linux
https://mail.zope.org/pipermail/cmf-tests/2011-July/015053.html


_______________________________________________
Zope-CMF maillist - Zope-CMF [at] zope
https://mail.zope.org/mailman/listinfo/zope-cmf

See https://bugs.launchpad.net/zope-cmf/ for bug reports and feature requests


noreply at zope

Jul 29, 2011, 10:00 PM

Post #28 of 75 (3820 views)
Permalink
cmf-tests - OK: 3, UNKNOWN: 1 [In reply to]

This is the summary for test reports received on the
cmf-tests list between 2011-07-28 00:00:00 UTC and 2011-07-29 00:00:00 UTC:

See the footnotes for test reports of unsuccessful builds.

An up-to date view of the builders is also available in our
buildbot documentation:
http://docs.zope.org/zopetoolkit/process/buildbots.html#the-nightly-builds

Reports received
----------------

CMF-2.2 Zope-2.12 Python-2.6.6 : Linux
CMF-2.2 Zope-2.13 Python-2.6.6 : Linux
CMF-trunk Zope-2.13 Python-2.6.6 : Linux
[1] FAILED (failures=3, errors=4) : CMF-trunk Zope-trunk Python-2.6.6 : Linux

Non-OK results
--------------

[1] UNKNOWN FAILED (failures=3, errors=4) : CMF-trunk Zope-trunk Python-2.6.6 : Linux
https://mail.zope.org/pipermail/cmf-tests/2011-July/015057.html


_______________________________________________
Zope-CMF maillist - Zope-CMF [at] zope
https://mail.zope.org/mailman/listinfo/zope-cmf

See https://bugs.launchpad.net/zope-cmf/ for bug reports and feature requests


noreply at zope

Jul 30, 2011, 10:00 PM

Post #29 of 75 (3814 views)
Permalink
cmf-tests - OK: 3, UNKNOWN: 1 [In reply to]

This is the summary for test reports received on the
cmf-tests list between 2011-07-29 00:00:00 UTC and 2011-07-30 00:00:00 UTC:

See the footnotes for test reports of unsuccessful builds.

An up-to date view of the builders is also available in our
buildbot documentation:
http://docs.zope.org/zopetoolkit/process/buildbots.html#the-nightly-builds

Reports received
----------------

CMF-2.2 Zope-2.12 Python-2.6.6 : Linux
CMF-2.2 Zope-2.13 Python-2.6.6 : Linux
CMF-trunk Zope-2.13 Python-2.6.6 : Linux
[1] FAILED (failures=3, errors=4) : CMF-trunk Zope-trunk Python-2.6.6 : Linux

Non-OK results
--------------

[1] UNKNOWN FAILED (failures=3, errors=4) : CMF-trunk Zope-trunk Python-2.6.6 : Linux
https://mail.zope.org/pipermail/cmf-tests/2011-July/015061.html


_______________________________________________
Zope-CMF maillist - Zope-CMF [at] zope
https://mail.zope.org/mailman/listinfo/zope-cmf

See https://bugs.launchpad.net/zope-cmf/ for bug reports and feature requests


noreply at zope

Jul 31, 2011, 10:00 PM

Post #30 of 75 (3806 views)
Permalink
cmf-tests - OK: 3, UNKNOWN: 1 [In reply to]

This is the summary for test reports received on the
cmf-tests list between 2011-07-30 00:00:00 UTC and 2011-07-31 00:00:00 UTC:

See the footnotes for test reports of unsuccessful builds.

An up-to date view of the builders is also available in our
buildbot documentation:
http://docs.zope.org/zopetoolkit/process/buildbots.html#the-nightly-builds

Reports received
----------------

CMF-2.2 Zope-2.12 Python-2.6.6 : Linux
CMF-2.2 Zope-2.13 Python-2.6.6 : Linux
CMF-trunk Zope-2.13 Python-2.6.6 : Linux
[1] FAILED (failures=3, errors=4) : CMF-trunk Zope-trunk Python-2.6.6 : Linux

Non-OK results
--------------

[1] UNKNOWN FAILED (failures=3, errors=4) : CMF-trunk Zope-trunk Python-2.6.6 : Linux
https://mail.zope.org/pipermail/cmf-tests/2011-July/015065.html


_______________________________________________
Zope-CMF maillist - Zope-CMF [at] zope
https://mail.zope.org/mailman/listinfo/zope-cmf

See https://bugs.launchpad.net/zope-cmf/ for bug reports and feature requests


noreply at zope

Aug 1, 2011, 10:00 PM

Post #31 of 75 (3803 views)
Permalink
cmf-tests - OK: 3, UNKNOWN: 1 [In reply to]

This is the summary for test reports received on the
cmf-tests list between 2011-07-31 00:00:00 UTC and 2011-08-01 00:00:00 UTC:

See the footnotes for test reports of unsuccessful builds.

An up-to date view of the builders is also available in our
buildbot documentation:
http://docs.zope.org/zopetoolkit/process/buildbots.html#the-nightly-builds

Reports received
----------------

CMF-2.2 Zope-2.12 Python-2.6.6 : Linux
CMF-2.2 Zope-2.13 Python-2.6.6 : Linux
CMF-trunk Zope-2.13 Python-2.6.6 : Linux
[1] FAILED (failures=3, errors=4) : CMF-trunk Zope-trunk Python-2.6.6 : Linux

Non-OK results
--------------

[1] UNKNOWN FAILED (failures=3, errors=4) : CMF-trunk Zope-trunk Python-2.6.6 : Linux
https://mail.zope.org/pipermail/cmf-tests/2011-August/015069.html


_______________________________________________
Zope-CMF maillist - Zope-CMF [at] zope
https://mail.zope.org/mailman/listinfo/zope-cmf

See https://bugs.launchpad.net/zope-cmf/ for bug reports and feature requests


noreply at zope

Aug 2, 2011, 10:00 PM

Post #32 of 75 (3788 views)
Permalink
cmf-tests - OK: 3, UNKNOWN: 1 [In reply to]

This is the summary for test reports received on the
cmf-tests list between 2011-08-01 00:00:00 UTC and 2011-08-02 00:00:00 UTC:

See the footnotes for test reports of unsuccessful builds.

An up-to date view of the builders is also available in our
buildbot documentation:
http://docs.zope.org/zopetoolkit/process/buildbots.html#the-nightly-builds

Reports received
----------------

CMF-2.2 Zope-2.12 Python-2.6.6 : Linux
CMF-2.2 Zope-2.13 Python-2.6.6 : Linux
CMF-trunk Zope-2.13 Python-2.6.6 : Linux
[1] UNKNOWN : CMF-trunk Zope-trunk Python-2.6.6 : Linux

Non-OK results
--------------

[1] UNKNOWN UNKNOWN : CMF-trunk Zope-trunk Python-2.6.6 : Linux
https://mail.zope.org/pipermail/cmf-tests/2011-August/015073.html


_______________________________________________
Zope-CMF maillist - Zope-CMF [at] zope
https://mail.zope.org/mailman/listinfo/zope-cmf

See https://bugs.launchpad.net/zope-cmf/ for bug reports and feature requests


noreply at zope

Aug 3, 2011, 10:00 PM

Post #33 of 75 (3770 views)
Permalink
cmf-tests - OK: 3, UNKNOWN: 1 [In reply to]

This is the summary for test reports received on the
cmf-tests list between 2011-08-02 00:00:00 UTC and 2011-08-03 00:00:00 UTC:

See the footnotes for test reports of unsuccessful builds.

An up-to date view of the builders is also available in our
buildbot documentation:
http://docs.zope.org/zopetoolkit/process/buildbots.html#the-nightly-builds

Reports received
----------------

CMF-2.2 Zope-2.12 Python-2.6.6 : Linux
CMF-2.2 Zope-2.13 Python-2.6.6 : Linux
CMF-trunk Zope-2.13 Python-2.6.6 : Linux
[1] FAILED (failures=3, errors=4) : CMF-trunk Zope-trunk Python-2.6.6 : Linux

Non-OK results
--------------

[1] UNKNOWN FAILED (failures=3, errors=4) : CMF-trunk Zope-trunk Python-2.6.6 : Linux
https://mail.zope.org/pipermail/cmf-tests/2011-August/015077.html


_______________________________________________
Zope-CMF maillist - Zope-CMF [at] zope
https://mail.zope.org/mailman/listinfo/zope-cmf

See https://bugs.launchpad.net/zope-cmf/ for bug reports and feature requests


noreply at zope

Aug 5, 2011, 10:00 PM

Post #34 of 75 (3754 views)
Permalink
cmf-tests - OK: 3, UNKNOWN: 1 [In reply to]

This is the summary for test reports received on the
cmf-tests list between 2011-08-04 00:00:00 UTC and 2011-08-05 00:00:00 UTC:

See the footnotes for test reports of unsuccessful builds.

An up-to date view of the builders is also available in our
buildbot documentation:
http://docs.zope.org/zopetoolkit/process/buildbots.html#the-nightly-builds

Reports received
----------------

CMF-2.2 Zope-2.12 Python-2.6.6 : Linux
CMF-2.2 Zope-2.13 Python-2.6.6 : Linux
CMF-trunk Zope-2.13 Python-2.6.6 : Linux
[1] FAILED (failures=3, errors=4) : CMF-trunk Zope-trunk Python-2.6.6 : Linux

Non-OK results
--------------

[1] UNKNOWN FAILED (failures=3, errors=4) : CMF-trunk Zope-trunk Python-2.6.6 : Linux
https://mail.zope.org/pipermail/cmf-tests/2011-August/015085.html


_______________________________________________
Zope-CMF maillist - Zope-CMF [at] zope
https://mail.zope.org/mailman/listinfo/zope-cmf

See https://bugs.launchpad.net/zope-cmf/ for bug reports and feature requests


noreply at zope

Aug 6, 2011, 10:00 PM

Post #35 of 75 (3735 views)
Permalink
cmf-tests - OK: 3, UNKNOWN: 1 [In reply to]

This is the summary for test reports received on the
cmf-tests list between 2011-08-05 00:00:00 UTC and 2011-08-06 00:00:00 UTC:

See the footnotes for test reports of unsuccessful builds.

An up-to date view of the builders is also available in our
buildbot documentation:
http://docs.zope.org/zopetoolkit/process/buildbots.html#the-nightly-builds

Reports received
----------------

CMF-2.2 Zope-2.12 Python-2.6.6 : Linux
CMF-2.2 Zope-2.13 Python-2.6.6 : Linux
CMF-trunk Zope-2.13 Python-2.6.6 : Linux
[1] FAILED (failures=3, errors=4) : CMF-trunk Zope-trunk Python-2.6.6 : Linux

Non-OK results
--------------

[1] UNKNOWN FAILED (failures=3, errors=4) : CMF-trunk Zope-trunk Python-2.6.6 : Linux
https://mail.zope.org/pipermail/cmf-tests/2011-August/015089.html


_______________________________________________
Zope-CMF maillist - Zope-CMF [at] zope
https://mail.zope.org/mailman/listinfo/zope-cmf

See https://bugs.launchpad.net/zope-cmf/ for bug reports and feature requests


jens at dataflake

Aug 7, 2011, 8:13 AM

Post #36 of 75 (3780 views)
Permalink
Re: cmf-tests - OK: 3, UNKNOWN: 1 [In reply to]

On Aug 7, 2011, at 07:00 , CMF tests summarizer wrote:
>
> [1] UNKNOWN FAILED (failures=3, errors=4) : CMF-trunk Zope-trunk Python-2.6.6 : Linux
> https://mail.zope.org/pipermail/cmf-tests/2011-August/015089.html

I have tried to pinpoint the reason for some of these test failures. Two of these tests are for the CMF Discussions functionality:

Failure in test test_deleteReplies (Products.CMFDefault.tests.test_Discussions.DiscussionTests)
Traceback (most recent call last):
File "/usr/local/lib/python2.6/unittest.py", line 279, in run
testMethod()
File "/usr/local/py26/cmf_trunk/src/Products.CMFDefault/Products/CMFDefault/tests/test_Discussions.py", line 301, in test_deleteReplies
self.assertEqual(len(ctool), 4)
File "/usr/local/lib/python2.6/unittest.py", line 350, in failUnlessEqual
(msg or '%r != %r' % (first, second))
AssertionError: 6 != 4

Failure in test test_itemCataloguing (Products.CMFDefault.tests.test_Discussions.DiscussionTests)
Traceback (most recent call last):
File "/usr/local/lib/python2.6/unittest.py", line 279, in run
testMethod()
File "/usr/local/py26/cmf_trunk/src/Products.CMFDefault/Products/CMFDefault/tests/test_Discussions.py", line 212, in test_itemCataloguing
% reply.getId()))
File "/usr/local/lib/python2.6/unittest.py", line 325, in failUnless
if not expr: raise self.failureException, msg
AssertionError

Those tests started failing after the following Zope-checkin:

http://svn.zope.org/?rev=122213&view=rev

What ends up happening in both cases is discussion replies ending up with a wrong idea about their physical path. Normally, they all should have a physical path that points to the "talkback" discussion container object attached to the original content item that houses the discussion, like so:

/path/to/content/talkback/12345
/path/to/content/talkback/12346
/path/to/content/talkback/12347


All of a sudden a "reply to a reply" thinks it is stored not in the content object's "talkback", but in a new "talkback" attached to the reply the user has replied to:

/path/to/content/talkback/12345
/path/to/content/talkback/12345/talkback/12346
/path/to/content/talkback/12345/talkback/12346/talkback/12347

The problem appears in CMFDefault.DiscussionItem.createReply on line 251, where the newly created discussion reply is aqcuisition-wrapped in the talkback object:

item = DiscussionItem( id, title=title, description=title )
self._container[id] = item
item = item.__of__(self)

After the wrapping, the discussion item has the wrong path. Even though "self", the "talkback" object, has the correct path when calling getPhysicalPath on it. I can't see anything overly stupid in the DiscussionItem code, so there has to be an issue with that Zope getPhysicalPath change. Reverting that one change in the current Zope trunk fixes the tests.

jens


_______________________________________________
Zope-CMF maillist - Zope-CMF [at] zope
https://mail.zope.org/mailman/listinfo/zope-cmf

See https://bugs.launchpad.net/zope-cmf/ for bug reports and feature requests


charlie.clark at clark-consulting

Aug 7, 2011, 11:25 AM

Post #37 of 75 (3713 views)
Permalink
Re: cmf-tests - OK: 3, UNKNOWN: 1 [In reply to]

Am 07.08.2011, 17:13 Uhr, schrieb Jens Vagelpohl <jens [at] dataflake>:

> The problem appears in CMFDefault.DiscussionItem.createReply on line
> 251, where the newly created discussion reply is aqcuisition-wrapped in
> the talkback object:
> item = DiscussionItem( id, title=title, description=title )
> self._container[id] = item
> item = item.__of__(self)
> After the wrapping, the discussion item has the wrong path. Even though
> "self", the "talkback" object, has the correct path when calling
> getPhysicalPath on it. I can't see anything overly stupid in the
> DiscussionItem code, so there has to be an issue with that Zope
> getPhysicalPath change. Reverting that one change in the current Zope
> trunk fixes the tests.

Ouch!

Hanno, have you got any stats on the optimisation? I looked briefly at the
changes and I'm not sure if this is really worth it.

http://svn.zope.org/Zope/trunk/src/OFS/Traversable.py?rev=122213&view=diff&r1=122213&r2=122212&p1=Zope/trunk/src/OFS/Traversable.py&p2=/Zope/trunk/src/OFS/Traversable.py

The revised method is significantly more complicated.

Charlie
--
Charlie Clark
Managing Director
Clark Consulting & Research
German Office
Helmholtzstr. 20
Düsseldorf
D- 40215
Tel: +49-211-600-3657
Mobile: +49-178-782-6226
_______________________________________________
Zope-CMF maillist - Zope-CMF [at] zope
https://mail.zope.org/mailman/listinfo/zope-cmf

See https://bugs.launchpad.net/zope-cmf/ for bug reports and feature requests


hanno at hannosch

Aug 7, 2011, 11:45 AM

Post #38 of 75 (3762 views)
Permalink
Re: cmf-tests - OK: 3, UNKNOWN: 1 [In reply to]

On Sun, Aug 7, 2011 at 8:25 PM, Charlie Clark
<charlie.clark [at] clark-consulting> wrote:
> Hanno, have you got any stats on the optimisation? I looked briefly at the
> changes and I'm not sure if this is really worth it.

Nikolay is working on this and some more evil looking patches at
https://github.com/fafhrd91/experimental.performance

These fixes combined currently result in almost a 50% speedup in
rendering time and cut down the number of function calls
significantly.

Just one example he shared with me for rendering the edit screen of a
page in Plone (req/s, function calls):

Stock Plone 4.2:

~5.5, 170000, /Plone/front-page/edit (manager)

With Chameleon:

~7.8, 101000, /Plone/front-page/edit (manager)

With evil looking optimizations:

~12.3, 43000, /Plone/front-page/edit (manager)

So yes, while these changes look at bit evil, they do have a major impact.

Hanno
_______________________________________________
Zope-CMF maillist - Zope-CMF [at] zope
https://mail.zope.org/mailman/listinfo/zope-cmf

See https://bugs.launchpad.net/zope-cmf/ for bug reports and feature requests


noreply at zope

Aug 7, 2011, 10:00 PM

Post #39 of 75 (3700 views)
Permalink
cmf-tests - OK: 3, UNKNOWN: 1 [In reply to]

This is the summary for test reports received on the
cmf-tests list between 2011-08-06 00:00:00 UTC and 2011-08-07 00:00:00 UTC:

See the footnotes for test reports of unsuccessful builds.

An up-to date view of the builders is also available in our
buildbot documentation:
http://docs.zope.org/zopetoolkit/process/buildbots.html#the-nightly-builds

Reports received
----------------

CMF-2.2 Zope-2.12 Python-2.6.6 : Linux
CMF-2.2 Zope-2.13 Python-2.6.6 : Linux
CMF-trunk Zope-2.13 Python-2.6.6 : Linux
[1] FAILED (failures=3, errors=4) : CMF-trunk Zope-trunk Python-2.6.6 : Linux

Non-OK results
--------------

[1] UNKNOWN FAILED (failures=3, errors=4) : CMF-trunk Zope-trunk Python-2.6.6 : Linux
https://mail.zope.org/pipermail/cmf-tests/2011-August/015093.html


_______________________________________________
Zope-CMF maillist - Zope-CMF [at] zope
https://mail.zope.org/mailman/listinfo/zope-cmf

See https://bugs.launchpad.net/zope-cmf/ for bug reports and feature requests


noreply at zope

Aug 8, 2011, 10:00 PM

Post #40 of 75 (3693 views)
Permalink
cmf-tests - OK: 3, UNKNOWN: 1 [In reply to]

This is the summary for test reports received on the
cmf-tests list between 2011-08-07 00:00:00 UTC and 2011-08-08 00:00:00 UTC:

See the footnotes for test reports of unsuccessful builds.

An up-to date view of the builders is also available in our
buildbot documentation:
http://docs.zope.org/zopetoolkit/process/buildbots.html#the-nightly-builds

Reports received
----------------

CMF-2.2 Zope-2.12 Python-2.6.6 : Linux
CMF-2.2 Zope-2.13 Python-2.6.6 : Linux
CMF-trunk Zope-2.13 Python-2.6.6 : Linux
[1] FAILED (failures=3, errors=4) : CMF-trunk Zope-trunk Python-2.6.6 : Linux

Non-OK results
--------------

[1] UNKNOWN FAILED (failures=3, errors=4) : CMF-trunk Zope-trunk Python-2.6.6 : Linux
https://mail.zope.org/pipermail/cmf-tests/2011-August/015097.html


_______________________________________________
Zope-CMF maillist - Zope-CMF [at] zope
https://mail.zope.org/mailman/listinfo/zope-cmf

See https://bugs.launchpad.net/zope-cmf/ for bug reports and feature requests


noreply at zope

Aug 9, 2011, 10:00 PM

Post #41 of 75 (3676 views)
Permalink
cmf-tests - OK: 3, UNKNOWN: 1 [In reply to]

This is the summary for test reports received on the
cmf-tests list between 2011-08-08 00:00:00 UTC and 2011-08-09 00:00:00 UTC:

See the footnotes for test reports of unsuccessful builds.

An up-to date view of the builders is also available in our
buildbot documentation:
http://docs.zope.org/zopetoolkit/process/buildbots.html#the-nightly-builds

Reports received
----------------

CMF-2.2 Zope-2.12 Python-2.6.6 : Linux
CMF-2.2 Zope-2.13 Python-2.6.6 : Linux
CMF-trunk Zope-2.13 Python-2.6.6 : Linux
[1] FAILED (failures=3, errors=4) : CMF-trunk Zope-trunk Python-2.6.6 : Linux

Non-OK results
--------------

[1] UNKNOWN FAILED (failures=3, errors=4) : CMF-trunk Zope-trunk Python-2.6.6 : Linux
https://mail.zope.org/pipermail/cmf-tests/2011-August/015101.html


_______________________________________________
Zope-CMF maillist - Zope-CMF [at] zope
https://mail.zope.org/mailman/listinfo/zope-cmf

See https://bugs.launchpad.net/zope-cmf/ for bug reports and feature requests


noreply at zope

Aug 10, 2011, 10:01 PM

Post #42 of 75 (3644 views)
Permalink
cmf-tests - OK: 3, UNKNOWN: 1 [In reply to]

This is the summary for test reports received on the
cmf-tests list between 2011-08-09 00:00:00 UTC and 2011-08-10 00:00:00 UTC:

See the footnotes for test reports of unsuccessful builds.

An up-to date view of the builders is also available in our
buildbot documentation:
http://docs.zope.org/zopetoolkit/process/buildbots.html#the-nightly-builds

Reports received
----------------

CMF-2.2 Zope-2.12 Python-2.6.6 : Linux
CMF-2.2 Zope-2.13 Python-2.6.6 : Linux
CMF-trunk Zope-2.13 Python-2.6.6 : Linux
[1] FAILED (failures=3, errors=4) : CMF-trunk Zope-trunk Python-2.6.6 : Linux

Non-OK results
--------------

[1] UNKNOWN FAILED (failures=3, errors=4) : CMF-trunk Zope-trunk Python-2.6.6 : Linux
https://mail.zope.org/pipermail/cmf-tests/2011-August/015105.html


_______________________________________________
Zope-CMF maillist - Zope-CMF [at] zope
https://mail.zope.org/mailman/listinfo/zope-cmf

See https://bugs.launchpad.net/zope-cmf/ for bug reports and feature requests


hanno at hannosch

Aug 11, 2011, 12:10 PM

Post #43 of 75 (3628 views)
Permalink
Re: cmf-tests - OK: 3, UNKNOWN: 1 [In reply to]

On Sun, Aug 7, 2011 at 5:13 PM, Jens Vagelpohl <jens [at] dataflake> wrote:
> After the wrapping, the discussion item has the wrong path. Even though "self", the "talkback" object, has the correct path when calling getPhysicalPath on it. I can't see anything overly stupid in the DiscussionItem code, so there has to be an issue with that Zope getPhysicalPath change. Reverting that one change in the current Zope trunk fixes the tests.

Thanks for the thorough analysis!

I tracked this down to a missing aq_inner call in the new
getPhysicalPath and fixed that.

The "ValueError: 'Access contents information' not found in inherited
permissions" failures remain, which are next on my list.

Hanno
_______________________________________________
Zope-CMF maillist - Zope-CMF [at] zope
https://mail.zope.org/mailman/listinfo/zope-cmf

See https://bugs.launchpad.net/zope-cmf/ for bug reports and feature requests


noreply at zope

Aug 11, 2011, 10:00 PM

Post #44 of 75 (3626 views)
Permalink
cmf-tests - OK: 3, UNKNOWN: 1 [In reply to]

This is the summary for test reports received on the
cmf-tests list between 2011-08-10 00:00:00 UTC and 2011-08-11 00:00:00 UTC:

See the footnotes for test reports of unsuccessful builds.

An up-to date view of the builders is also available in our
buildbot documentation:
http://docs.zope.org/zopetoolkit/process/buildbots.html#the-nightly-builds

Reports received
----------------

CMF-2.2 Zope-2.12 Python-2.6.6 : Linux
CMF-2.2 Zope-2.13 Python-2.6.6 : Linux
CMF-trunk Zope-2.13 Python-2.6.6 : Linux
[1] FAILED (failures=3, errors=4) : CMF-trunk Zope-trunk Python-2.6.6 : Linux

Non-OK results
--------------

[1] UNKNOWN FAILED (failures=3, errors=4) : CMF-trunk Zope-trunk Python-2.6.6 : Linux
https://mail.zope.org/pipermail/cmf-tests/2011-August/015109.html


_______________________________________________
Zope-CMF maillist - Zope-CMF [at] zope
https://mail.zope.org/mailman/listinfo/zope-cmf

See https://bugs.launchpad.net/zope-cmf/ for bug reports and feature requests


noreply at zope

Aug 18, 2011, 10:00 PM

Post #45 of 75 (3525 views)
Permalink
cmf-tests - OK: 3, UNKNOWN: 1 [In reply to]

This is the summary for test reports received on the
cmf-tests list between 2011-08-17 00:00:00 UTC and 2011-08-18 00:00:00 UTC:

See the footnotes for test reports of unsuccessful builds.

An up-to date view of the builders is also available in our
buildbot documentation:
http://docs.zope.org/zopetoolkit/process/buildbots.html#the-nightly-builds

Reports received
----------------

CMF-2.2 Zope-2.12 Python-2.6.6 : Linux
CMF-trunk Zope-2.13 Python-2.6.6 : Linux
CMF-trunk Zope-trunk Python-2.6.6 : Linux
[1] UNKNOWN : CMF-2.2 Zope-2.13 Python-2.6.6 : Linux

Non-OK results
--------------

[1] UNKNOWN UNKNOWN : CMF-2.2 Zope-2.13 Python-2.6.6 : Linux
https://mail.zope.org/pipermail/cmf-tests/2011-August/015135.html


_______________________________________________
Zope-CMF maillist - Zope-CMF [at] zope
https://mail.zope.org/mailman/listinfo/zope-cmf

See https://bugs.launchpad.net/zope-cmf/ for bug reports and feature requests


noreply at zope

Aug 22, 2011, 10:00 PM

Post #46 of 75 (3445 views)
Permalink
cmf-tests - OK: 3, UNKNOWN: 1 [In reply to]

This is the summary for test reports received on the
cmf-tests list between 2011-08-21 00:00:00 UTC and 2011-08-22 00:00:00 UTC:

See the footnotes for test reports of unsuccessful builds.

An up-to date view of the builders is also available in our
buildbot documentation:
http://docs.zope.org/zopetoolkit/process/buildbots.html#the-nightly-builds

Reports received
----------------

CMF-2.2 Zope-2.12 Python-2.6.6 : Linux
CMF-2.2 Zope-2.13 Python-2.6.6 : Linux
CMF-trunk Zope-2.13 Python-2.6.6 : Linux
[1] FAILED (failures=16, errors=13) : CMF-trunk Zope-trunk Python-2.6.6 : Linux

Non-OK results
--------------

[1] UNKNOWN FAILED (failures=16, errors=13) : CMF-trunk Zope-trunk Python-2.6.6 : Linux
https://mail.zope.org/pipermail/cmf-tests/2011-August/015153.html


_______________________________________________
Zope-CMF maillist - Zope-CMF [at] zope
https://mail.zope.org/mailman/listinfo/zope-cmf

See https://bugs.launchpad.net/zope-cmf/ for bug reports and feature requests


charlie.clark at clark-consulting

Aug 23, 2011, 1:14 AM

Post #47 of 75 (3459 views)
Permalink
Re: cmf-tests - OK: 3, UNKNOWN: 1 [In reply to]

Am 23.08.2011, 07:00 Uhr, schrieb CMF tests summarizer <noreply [at] zope>:

> [1] UNKNOWN FAILED (failures=16, errors=13) : CMF-trunk Zope-trunk
> Python-2.6.6 : Linux
> https://mail.zope.org/pipermail/cmf-tests/2011-August/015153.html

This one is beyond my feeble powers. It looks like all the doctests are
failing.

Charlie
--
Charlie Clark
Managing Director
Clark Consulting & Research
German Office
Helmholtzstr. 20
Düsseldorf
D- 40215
Tel: +49-211-600-3657
Mobile: +49-178-782-6226
_______________________________________________
Zope-CMF maillist - Zope-CMF [at] zope
https://mail.zope.org/mailman/listinfo/zope-cmf

See https://bugs.launchpad.net/zope-cmf/ for bug reports and feature requests


y.2011 at wcm-solutions

Aug 23, 2011, 2:03 AM

Post #48 of 75 (3461 views)
Permalink
Re: cmf-tests - OK: 3, UNKNOWN: 1 [In reply to]

Charlie Clark wrote:
> Am 23.08.2011, 07:00 Uhr, schrieb CMF tests summarizer<noreply [at] zope>:
>
>> [1] UNKNOWN FAILED (failures=16, errors=13) : CMF-trunk Zope-trunk
>> Python-2.6.6 : Linux
>> https://mail.zope.org/pipermail/cmf-tests/2011-August/015153.html
>
> This one is beyond my feeble powers. It looks like all the doctests are
> failing.
>
> Charlie

Zope trunk is broken, it has similar failures and errors:

https://mail.zope.org/pipermail/zope-tests/2011-August/048589.html

Yuppie
_______________________________________________
Zope-CMF maillist - Zope-CMF [at] zope
https://mail.zope.org/mailman/listinfo/zope-cmf

See https://bugs.launchpad.net/zope-cmf/ for bug reports and feature requests


noreply at zope

Aug 23, 2011, 10:00 PM

Post #49 of 75 (3421 views)
Permalink
cmf-tests - OK: 3, UNKNOWN: 1 [In reply to]

This is the summary for test reports received on the
cmf-tests list between 2011-08-22 00:00:00 UTC and 2011-08-23 00:00:00 UTC:

See the footnotes for test reports of unsuccessful builds.

An up-to date view of the builders is also available in our
buildbot documentation:
http://docs.zope.org/zopetoolkit/process/buildbots.html#the-nightly-builds

Reports received
----------------

CMF-2.2 Zope-2.12 Python-2.6.6 : Linux
CMF-2.2 Zope-2.13 Python-2.6.6 : Linux
CMF-trunk Zope-2.13 Python-2.6.6 : Linux
[1] FAILED (failures=16, errors=13) : CMF-trunk Zope-trunk Python-2.6.6 : Linux

Non-OK results
--------------

[1] UNKNOWN FAILED (failures=16, errors=13) : CMF-trunk Zope-trunk Python-2.6.6 : Linux
https://mail.zope.org/pipermail/cmf-tests/2011-August/015157.html


_______________________________________________
Zope-CMF maillist - Zope-CMF [at] zope
https://mail.zope.org/mailman/listinfo/zope-cmf

See https://bugs.launchpad.net/zope-cmf/ for bug reports and feature requests


noreply at zope

Aug 24, 2011, 10:00 PM

Post #50 of 75 (3410 views)
Permalink
cmf-tests - OK: 3, UNKNOWN: 1 [In reply to]

This is the summary for test reports received on the
cmf-tests list between 2011-08-23 00:00:00 UTC and 2011-08-24 00:00:00 UTC:

See the footnotes for test reports of unsuccessful builds.

An up-to date view of the builders is also available in our
buildbot documentation:
http://docs.zope.org/zopetoolkit/process/buildbots.html#the-nightly-builds

Reports received
----------------

CMF-2.2 Zope-2.12 Python-2.6.6 : Linux
CMF-2.2 Zope-2.13 Python-2.6.6 : Linux
CMF-trunk Zope-2.13 Python-2.6.6 : Linux
[1] FAILED (failures=1) : CMF-trunk Zope-trunk Python-2.6.6 : Linux

Non-OK results
--------------

[1] UNKNOWN FAILED (failures=1) : CMF-trunk Zope-trunk Python-2.6.6 : Linux
https://mail.zope.org/pipermail/cmf-tests/2011-August/015161.html


_______________________________________________
Zope-CMF maillist - Zope-CMF [at] zope
https://mail.zope.org/mailman/listinfo/zope-cmf

See https://bugs.launchpad.net/zope-cmf/ for bug reports and feature requests


noreply at zope

Aug 25, 2011, 10:00 PM

Post #51 of 75 (4609 views)
Permalink
cmf-tests - OK: 3, UNKNOWN: 1 [In reply to]

This is the summary for test reports received on the
cmf-tests list between 2011-08-24 00:00:00 UTC and 2011-08-25 00:00:00 UTC:

See the footnotes for test reports of unsuccessful builds.

An up-to date view of the builders is also available in our
buildbot documentation:
http://docs.zope.org/zopetoolkit/process/buildbots.html#the-nightly-builds

Reports received
----------------

CMF-2.2 Zope-2.12 Python-2.6.6 : Linux
CMF-2.2 Zope-2.13 Python-2.6.6 : Linux
CMF-trunk Zope-2.13 Python-2.6.6 : Linux
[1] UNKNOWN : CMF-trunk Zope-trunk Python-2.6.6 : Linux

Non-OK results
--------------

[1] UNKNOWN UNKNOWN : CMF-trunk Zope-trunk Python-2.6.6 : Linux
https://mail.zope.org/pipermail/cmf-tests/2011-August/015165.html


_______________________________________________
Zope-CMF maillist - Zope-CMF [at] zope
https://mail.zope.org/mailman/listinfo/zope-cmf

See https://bugs.launchpad.net/zope-cmf/ for bug reports and feature requests


noreply at zope

Aug 26, 2011, 10:00 PM

Post #52 of 75 (4605 views)
Permalink
cmf-tests - OK: 3, UNKNOWN: 1 [In reply to]

This is the summary for test reports received on the
cmf-tests list between 2011-08-25 00:00:00 UTC and 2011-08-26 00:00:00 UTC:

See the footnotes for test reports of unsuccessful builds.

An up-to date view of the builders is also available in our
buildbot documentation:
http://docs.zope.org/zopetoolkit/process/buildbots.html#the-nightly-builds

Reports received
----------------

CMF-2.2 Zope-2.12 Python-2.6.6 : Linux
CMF-2.2 Zope-2.13 Python-2.6.6 : Linux
CMF-trunk Zope-2.13 Python-2.6.6 : Linux
[1] FAILED (failures=1) : CMF-trunk Zope-trunk Python-2.6.6 : Linux

Non-OK results
--------------

[1] UNKNOWN FAILED (failures=1) : CMF-trunk Zope-trunk Python-2.6.6 : Linux
https://mail.zope.org/pipermail/cmf-tests/2011-August/015169.html


_______________________________________________
Zope-CMF maillist - Zope-CMF [at] zope
https://mail.zope.org/mailman/listinfo/zope-cmf

See https://bugs.launchpad.net/zope-cmf/ for bug reports and feature requests


noreply at zope

Aug 27, 2011, 10:00 PM

Post #53 of 75 (4598 views)
Permalink
cmf-tests - OK: 3, UNKNOWN: 1 [In reply to]

This is the summary for test reports received on the
cmf-tests list between 2011-08-26 00:00:00 UTC and 2011-08-27 00:00:00 UTC:

See the footnotes for test reports of unsuccessful builds.

An up-to date view of the builders is also available in our
buildbot documentation:
http://docs.zope.org/zopetoolkit/process/buildbots.html#the-nightly-builds

Reports received
----------------

CMF-2.2 Zope-2.12 Python-2.6.6 : Linux
CMF-2.2 Zope-2.13 Python-2.6.6 : Linux
CMF-trunk Zope-2.13 Python-2.6.6 : Linux
[1] FAILED (failures=1) : CMF-trunk Zope-trunk Python-2.6.6 : Linux

Non-OK results
--------------

[1] UNKNOWN FAILED (failures=1) : CMF-trunk Zope-trunk Python-2.6.6 : Linux
https://mail.zope.org/pipermail/cmf-tests/2011-August/015173.html


_______________________________________________
Zope-CMF maillist - Zope-CMF [at] zope
https://mail.zope.org/mailman/listinfo/zope-cmf

See https://bugs.launchpad.net/zope-cmf/ for bug reports and feature requests


noreply at zope

Aug 28, 2011, 10:00 PM

Post #54 of 75 (4594 views)
Permalink
cmf-tests - OK: 3, UNKNOWN: 1 [In reply to]

This is the summary for test reports received on the
cmf-tests list between 2011-08-27 00:00:00 UTC and 2011-08-28 00:00:00 UTC:

See the footnotes for test reports of unsuccessful builds.

An up-to date view of the builders is also available in our
buildbot documentation:
http://docs.zope.org/zopetoolkit/process/buildbots.html#the-nightly-builds

Reports received
----------------

CMF-2.2 Zope-2.12 Python-2.6.6 : Linux
CMF-2.2 Zope-2.13 Python-2.6.6 : Linux
CMF-trunk Zope-2.13 Python-2.6.6 : Linux
[1] FAILED (failures=1) : CMF-trunk Zope-trunk Python-2.6.6 : Linux

Non-OK results
--------------

[1] UNKNOWN FAILED (failures=1) : CMF-trunk Zope-trunk Python-2.6.6 : Linux
https://mail.zope.org/pipermail/cmf-tests/2011-August/015177.html


_______________________________________________
Zope-CMF maillist - Zope-CMF [at] zope
https://mail.zope.org/mailman/listinfo/zope-cmf

See https://bugs.launchpad.net/zope-cmf/ for bug reports and feature requests


noreply at zope

Aug 30, 2011, 1:03 AM

Post #55 of 75 (4582 views)
Permalink
cmf-tests - OK: 3, UNKNOWN: 1 [In reply to]

This is the summary for test reports received on the
cmf-tests list between 2011-08-28 00:00:00 UTC and 2011-08-29 00:00:00 UTC:

See the footnotes for test reports of unsuccessful builds.

An up-to date view of the builders is also available in our
buildbot documentation:
http://docs.zope.org/zopetoolkit/process/buildbots.html#the-nightly-builds

Reports received
----------------

CMF-2.2 Zope-2.12 Python-2.6.6 : Linux
CMF-2.2 Zope-2.13 Python-2.6.6 : Linux
CMF-trunk Zope-2.13 Python-2.6.6 : Linux
[1] FAILED (failures=1) : CMF-trunk Zope-trunk Python-2.6.6 : Linux

Non-OK results
--------------

[1] UNKNOWN FAILED (failures=1) : CMF-trunk Zope-trunk Python-2.6.6 : Linux
https://mail.zope.org/pipermail/cmf-tests/2011-August/015181.html


_______________________________________________
Zope-CMF maillist - Zope-CMF [at] zope
https://mail.zope.org/mailman/listinfo/zope-cmf

See https://bugs.launchpad.net/zope-cmf/ for bug reports and feature requests


noreply at zope

Aug 30, 2011, 6:00 PM

Post #56 of 75 (4573 views)
Permalink
cmf-tests - OK: 3, UNKNOWN: 1 [In reply to]

This is the summary for test reports received on the
cmf-tests list between 2011-08-29 00:00:00 UTC and 2011-08-30 00:00:00 UTC:

See the footnotes for test reports of unsuccessful builds.

An up-to date view of the builders is also available in our
buildbot documentation:
http://docs.zope.org/zopetoolkit/process/buildbots.html#the-nightly-builds

Reports received
----------------

CMF-2.2 Zope-2.12 Python-2.6.6 : Linux
CMF-2.2 Zope-2.13 Python-2.6.6 : Linux
CMF-trunk Zope-2.13 Python-2.6.6 : Linux
[1] FAILED (failures=1) : CMF-trunk Zope-trunk Python-2.6.6 : Linux

Non-OK results
--------------

[1] UNKNOWN FAILED (failures=1) : CMF-trunk Zope-trunk Python-2.6.6 : Linux
https://mail.zope.org/pipermail/cmf-tests/2011-August/015185.html


_______________________________________________
Zope-CMF maillist - Zope-CMF [at] zope
https://mail.zope.org/mailman/listinfo/zope-cmf

See https://bugs.launchpad.net/zope-cmf/ for bug reports and feature requests


noreply at zope

Aug 31, 2011, 6:00 PM

Post #57 of 75 (4576 views)
Permalink
cmf-tests - OK: 3, UNKNOWN: 1 [In reply to]

This is the summary for test reports received on the
cmf-tests list between 2011-08-30 00:00:00 UTC and 2011-08-31 00:00:00 UTC:

See the footnotes for test reports of unsuccessful builds.

An up-to date view of the builders is also available in our
buildbot documentation:
http://docs.zope.org/zopetoolkit/process/buildbots.html#the-nightly-builds

Reports received
----------------

CMF-2.2 Zope-2.12 Python-2.6.6 : Linux
CMF-2.2 Zope-2.13 Python-2.6.6 : Linux
CMF-trunk Zope-2.13 Python-2.6.6 : Linux
[1] FAILED (failures=1) : CMF-trunk Zope-trunk Python-2.6.6 : Linux

Non-OK results
--------------

[1] UNKNOWN FAILED (failures=1) : CMF-trunk Zope-trunk Python-2.6.6 : Linux
https://mail.zope.org/pipermail/cmf-tests/2011-August/015189.html


_______________________________________________
Zope-CMF maillist - Zope-CMF [at] zope
https://mail.zope.org/mailman/listinfo/zope-cmf

See https://bugs.launchpad.net/zope-cmf/ for bug reports and feature requests


noreply at zope

Sep 1, 2011, 6:00 PM

Post #58 of 75 (4556 views)
Permalink
cmf-tests - OK: 3, UNKNOWN: 1 [In reply to]

This is the summary for test reports received on the
cmf-tests list between 2011-08-31 00:00:00 UTC and 2011-09-01 00:00:00 UTC:

See the footnotes for test reports of unsuccessful builds.

An up-to date view of the builders is also available in our
buildbot documentation:
http://docs.zope.org/zopetoolkit/process/buildbots.html#the-nightly-builds

Reports received
----------------

CMF-2.2 Zope-2.12 Python-2.6.6 : Linux
CMF-2.2 Zope-2.13 Python-2.6.6 : Linux
CMF-trunk Zope-2.13 Python-2.6.6 : Linux
[1] FAILED (failures=1) : CMF-trunk Zope-trunk Python-2.6.6 : Linux

Non-OK results
--------------

[1] UNKNOWN FAILED (failures=1) : CMF-trunk Zope-trunk Python-2.6.6 : Linux
https://mail.zope.org/pipermail/cmf-tests/2011-September/015193.html


_______________________________________________
Zope-CMF maillist - Zope-CMF [at] zope
https://mail.zope.org/mailman/listinfo/zope-cmf

See https://bugs.launchpad.net/zope-cmf/ for bug reports and feature requests


noreply at zope

Sep 2, 2011, 6:00 PM

Post #59 of 75 (4541 views)
Permalink
cmf-tests - OK: 3, UNKNOWN: 1 [In reply to]

This is the summary for test reports received on the
cmf-tests list between 2011-09-01 00:00:00 UTC and 2011-09-02 00:00:00 UTC:

See the footnotes for test reports of unsuccessful builds.

An up-to date view of the builders is also available in our
buildbot documentation:
http://docs.zope.org/zopetoolkit/process/buildbots.html#the-nightly-builds

Reports received
----------------

CMF-2.2 Zope-2.12 Python-2.6.6 : Linux
CMF-2.2 Zope-2.13 Python-2.6.6 : Linux
CMF-trunk Zope-2.13 Python-2.6.6 : Linux
[1] FAILED (failures=1) : CMF-trunk Zope-trunk Python-2.6.6 : Linux

Non-OK results
--------------

[1] UNKNOWN FAILED (failures=1) : CMF-trunk Zope-trunk Python-2.6.6 : Linux
https://mail.zope.org/pipermail/cmf-tests/2011-September/015197.html


_______________________________________________
Zope-CMF maillist - Zope-CMF [at] zope
https://mail.zope.org/mailman/listinfo/zope-cmf

See https://bugs.launchpad.net/zope-cmf/ for bug reports and feature requests


noreply at zope

Sep 3, 2011, 6:00 PM

Post #60 of 75 (4524 views)
Permalink
cmf-tests - OK: 3, UNKNOWN: 1 [In reply to]

This is the summary for test reports received on the
cmf-tests list between 2011-09-02 00:00:00 UTC and 2011-09-03 00:00:00 UTC:

See the footnotes for test reports of unsuccessful builds.

An up-to date view of the builders is also available in our
buildbot documentation:
http://docs.zope.org/zopetoolkit/process/buildbots.html#the-nightly-builds

Reports received
----------------

CMF-2.2 Zope-2.12 Python-2.6.6 : Linux
CMF-2.2 Zope-2.13 Python-2.6.6 : Linux
CMF-trunk Zope-2.13 Python-2.6.6 : Linux
[1] FAILED (failures=1) : CMF-trunk Zope-trunk Python-2.6.6 : Linux

Non-OK results
--------------

[1] UNKNOWN FAILED (failures=1) : CMF-trunk Zope-trunk Python-2.6.6 : Linux
https://mail.zope.org/pipermail/cmf-tests/2011-September/015201.html


_______________________________________________
Zope-CMF maillist - Zope-CMF [at] zope
https://mail.zope.org/mailman/listinfo/zope-cmf

See https://bugs.launchpad.net/zope-cmf/ for bug reports and feature requests


noreply at zope

Sep 4, 2011, 6:01 PM

Post #61 of 75 (4499 views)
Permalink
cmf-tests - OK: 3, UNKNOWN: 1 [In reply to]

This is the summary for test reports received on the
cmf-tests list between 2011-09-03 00:00:00 UTC and 2011-09-04 00:00:00 UTC:

See the footnotes for test reports of unsuccessful builds.

An up-to date view of the builders is also available in our
buildbot documentation:
http://docs.zope.org/zopetoolkit/process/buildbots.html#the-nightly-builds

Reports received
----------------

CMF-2.2 Zope-2.12 Python-2.6.6 : Linux
CMF-2.2 Zope-2.13 Python-2.6.6 : Linux
CMF-trunk Zope-2.13 Python-2.6.6 : Linux
[1] FAILED (failures=1) : CMF-trunk Zope-trunk Python-2.6.6 : Linux

Non-OK results
--------------

[1] UNKNOWN FAILED (failures=1) : CMF-trunk Zope-trunk Python-2.6.6 : Linux
https://mail.zope.org/pipermail/cmf-tests/2011-September/015205.html


_______________________________________________
Zope-CMF maillist - Zope-CMF [at] zope
https://mail.zope.org/mailman/listinfo/zope-cmf

See https://bugs.launchpad.net/zope-cmf/ for bug reports and feature requests


noreply at zope

Sep 6, 2011, 6:01 PM

Post #62 of 75 (4470 views)
Permalink
cmf-tests - OK: 3, UNKNOWN: 1 [In reply to]

This is the summary for test reports received on the
cmf-tests list between 2011-09-05 00:00:00 UTC and 2011-09-06 00:00:00 UTC:

See the footnotes for test reports of unsuccessful builds.

An up-to date view of the builders is also available in our
buildbot documentation:
http://docs.zope.org/zopetoolkit/process/buildbots.html#the-nightly-builds

Reports received
----------------

CMF-2.2 Zope-2.12 Python-2.6.6 : Linux
CMF-2.2 Zope-2.13 Python-2.6.6 : Linux
CMF-trunk Zope-2.13 Python-2.6.6 : Linux
[1] FAILED (failures=1) : CMF-trunk Zope-trunk Python-2.6.6 : Linux

Non-OK results
--------------

[1] UNKNOWN FAILED (failures=1) : CMF-trunk Zope-trunk Python-2.6.6 : Linux
https://mail.zope.org/pipermail/cmf-tests/2011-September/015213.html


_______________________________________________
Zope-CMF maillist - Zope-CMF [at] zope
https://mail.zope.org/mailman/listinfo/zope-cmf

See https://bugs.launchpad.net/zope-cmf/ for bug reports and feature requests


noreply at zope

Sep 7, 2011, 6:00 PM

Post #63 of 75 (4450 views)
Permalink
cmf-tests - OK: 3, UNKNOWN: 1 [In reply to]

This is the summary for test reports received on the
cmf-tests list between 2011-09-06 00:00:00 UTC and 2011-09-07 00:00:00 UTC:

See the footnotes for test reports of unsuccessful builds.

An up-to date view of the builders is also available in our
buildbot documentation:
http://docs.zope.org/zopetoolkit/process/buildbots.html#the-nightly-builds

Reports received
----------------

CMF-2.2 Zope-2.12 Python-2.6.6 : Linux
CMF-2.2 Zope-2.13 Python-2.6.6 : Linux
CMF-trunk Zope-2.13 Python-2.6.6 : Linux
[1] FAILED (failures=1) : CMF-trunk Zope-trunk Python-2.6.6 : Linux

Non-OK results
--------------

[1] UNKNOWN FAILED (failures=1) : CMF-trunk Zope-trunk Python-2.6.6 : Linux
https://mail.zope.org/pipermail/cmf-tests/2011-September/015217.html


_______________________________________________
Zope-CMF maillist - Zope-CMF [at] zope
https://mail.zope.org/mailman/listinfo/zope-cmf

See https://bugs.launchpad.net/zope-cmf/ for bug reports and feature requests


noreply at zope

Sep 8, 2011, 6:00 PM

Post #64 of 75 (4439 views)
Permalink
cmf-tests - OK: 3, UNKNOWN: 1 [In reply to]

This is the summary for test reports received on the
cmf-tests list between 2011-09-07 00:00:00 UTC and 2011-09-08 00:00:00 UTC:

See the footnotes for test reports of unsuccessful builds.

An up-to date view of the builders is also available in our
buildbot documentation:
http://docs.zope.org/zopetoolkit/process/buildbots.html#the-nightly-builds

Reports received
----------------

CMF-2.2 Zope-2.12 Python-2.6.6 : Linux
CMF-2.2 Zope-2.13 Python-2.6.6 : Linux
CMF-trunk Zope-2.13 Python-2.6.6 : Linux
[1] FAILED (failures=1) : CMF-trunk Zope-trunk Python-2.6.6 : Linux

Non-OK results
--------------

[1] UNKNOWN FAILED (failures=1) : CMF-trunk Zope-trunk Python-2.6.6 : Linux
https://mail.zope.org/pipermail/cmf-tests/2011-September/015221.html


_______________________________________________
Zope-CMF maillist - Zope-CMF [at] zope
https://mail.zope.org/mailman/listinfo/zope-cmf

See https://bugs.launchpad.net/zope-cmf/ for bug reports and feature requests


noreply at zope

Sep 9, 2011, 6:00 PM

Post #65 of 75 (4420 views)
Permalink
cmf-tests - OK: 3, UNKNOWN: 1 [In reply to]

This is the summary for test reports received on the
cmf-tests list between 2011-09-08 00:00:00 UTC and 2011-09-09 00:00:00 UTC:

See the footnotes for test reports of unsuccessful builds.

An up-to date view of the builders is also available in our
buildbot documentation:
http://docs.zope.org/zopetoolkit/process/buildbots.html#the-nightly-builds

Reports received
----------------

CMF-2.2 Zope-2.12 Python-2.6.6 : Linux
CMF-2.2 Zope-2.13 Python-2.6.6 : Linux
CMF-trunk Zope-2.13 Python-2.6.6 : Linux
[1] FAILED (failures=1) : CMF-trunk Zope-trunk Python-2.6.6 : Linux

Non-OK results
--------------

[1] UNKNOWN FAILED (failures=1) : CMF-trunk Zope-trunk Python-2.6.6 : Linux
https://mail.zope.org/pipermail/cmf-tests/2011-September/015225.html


_______________________________________________
Zope-CMF maillist - Zope-CMF [at] zope
https://mail.zope.org/mailman/listinfo/zope-cmf

See https://bugs.launchpad.net/zope-cmf/ for bug reports and feature requests


noreply at zope

Sep 10, 2011, 6:00 PM

Post #66 of 75 (4402 views)
Permalink
cmf-tests - OK: 3, UNKNOWN: 1 [In reply to]

This is the summary for test reports received on the
cmf-tests list between 2011-09-09 00:00:00 UTC and 2011-09-10 00:00:00 UTC:

See the footnotes for test reports of unsuccessful builds.

An up-to date view of the builders is also available in our
buildbot documentation:
http://docs.zope.org/zopetoolkit/process/buildbots.html#the-nightly-builds

Reports received
----------------

CMF-2.2 Zope-2.12 Python-2.6.6 : Linux
CMF-2.2 Zope-2.13 Python-2.6.6 : Linux
CMF-trunk Zope-2.13 Python-2.6.6 : Linux
[1] FAILED (failures=1) : CMF-trunk Zope-trunk Python-2.6.6 : Linux

Non-OK results
--------------

[1] UNKNOWN FAILED (failures=1) : CMF-trunk Zope-trunk Python-2.6.6 : Linux
https://mail.zope.org/pipermail/cmf-tests/2011-September/015229.html


_______________________________________________
Zope-CMF maillist - Zope-CMF [at] zope
https://mail.zope.org/mailman/listinfo/zope-cmf

See https://bugs.launchpad.net/zope-cmf/ for bug reports and feature requests


noreply at zope

Sep 11, 2011, 6:00 PM

Post #67 of 75 (4374 views)
Permalink
cmf-tests - OK: 3, UNKNOWN: 1 [In reply to]

This is the summary for test reports received on the
cmf-tests list between 2011-09-10 00:00:00 UTC and 2011-09-11 00:00:00 UTC:

See the footnotes for test reports of unsuccessful builds.

An up-to date view of the builders is also available in our
buildbot documentation:
http://docs.zope.org/zopetoolkit/process/buildbots.html#the-nightly-builds

Reports received
----------------

CMF-2.2 Zope-2.12 Python-2.6.6 : Linux
CMF-2.2 Zope-2.13 Python-2.6.6 : Linux
CMF-trunk Zope-2.13 Python-2.6.6 : Linux
[1] FAILED (failures=1) : CMF-trunk Zope-trunk Python-2.6.6 : Linux

Non-OK results
--------------

[1] UNKNOWN FAILED (failures=1) : CMF-trunk Zope-trunk Python-2.6.6 : Linux
https://mail.zope.org/pipermail/cmf-tests/2011-September/015233.html


_______________________________________________
Zope-CMF maillist - Zope-CMF [at] zope
https://mail.zope.org/mailman/listinfo/zope-cmf

See https://bugs.launchpad.net/zope-cmf/ for bug reports and feature requests


noreply at zope

Sep 12, 2011, 6:00 PM

Post #68 of 75 (4357 views)
Permalink
cmf-tests - OK: 3, UNKNOWN: 1 [In reply to]

This is the summary for test reports received on the
cmf-tests list between 2011-09-11 00:00:00 UTC and 2011-09-12 00:00:00 UTC:

See the footnotes for test reports of unsuccessful builds.

An up-to date view of the builders is also available in our
buildbot documentation:
http://docs.zope.org/zopetoolkit/process/buildbots.html#the-nightly-builds

Reports received
----------------

CMF-2.2 Zope-2.12 Python-2.6.6 : Linux
CMF-2.2 Zope-2.13 Python-2.6.6 : Linux
CMF-trunk Zope-2.13 Python-2.6.6 : Linux
[1] FAILED (failures=1) : CMF-trunk Zope-trunk Python-2.6.6 : Linux

Non-OK results
--------------

[1] UNKNOWN FAILED (failures=1) : CMF-trunk Zope-trunk Python-2.6.6 : Linux
https://mail.zope.org/pipermail/cmf-tests/2011-September/015237.html


_______________________________________________
Zope-CMF maillist - Zope-CMF [at] zope
https://mail.zope.org/mailman/listinfo/zope-cmf

See https://bugs.launchpad.net/zope-cmf/ for bug reports and feature requests


noreply at zope

Sep 13, 2011, 6:00 PM

Post #69 of 75 (4357 views)
Permalink
cmf-tests - OK: 3, UNKNOWN: 1 [In reply to]

This is the summary for test reports received on the
cmf-tests list between 2011-09-12 00:00:00 UTC and 2011-09-13 00:00:00 UTC:

See the footnotes for test reports of unsuccessful builds.

An up-to date view of the builders is also available in our
buildbot documentation:
http://docs.zope.org/zopetoolkit/process/buildbots.html#the-nightly-builds

Reports received
----------------

CMF-2.2 Zope-2.12 Python-2.6.6 : Linux
CMF-2.2 Zope-2.13 Python-2.6.6 : Linux
CMF-trunk Zope-2.13 Python-2.6.6 : Linux
[1] FAILED (failures=1) : CMF-trunk Zope-trunk Python-2.6.6 : Linux

Non-OK results
--------------

[1] UNKNOWN FAILED (failures=1) : CMF-trunk Zope-trunk Python-2.6.6 : Linux
https://mail.zope.org/pipermail/cmf-tests/2011-September/015241.html


_______________________________________________
Zope-CMF maillist - Zope-CMF [at] zope
https://mail.zope.org/mailman/listinfo/zope-cmf

See https://bugs.launchpad.net/zope-cmf/ for bug reports and feature requests


noreply at zope

Sep 14, 2011, 6:00 PM

Post #70 of 75 (4321 views)
Permalink
cmf-tests - OK: 3, UNKNOWN: 1 [In reply to]

This is the summary for test reports received on the
cmf-tests list between 2011-09-13 00:00:00 UTC and 2011-09-14 00:00:00 UTC:

See the footnotes for test reports of unsuccessful builds.

An up-to date view of the builders is also available in our
buildbot documentation:
http://docs.zope.org/zopetoolkit/process/buildbots.html#the-nightly-builds

Reports received
----------------

CMF-2.2 Zope-2.12 Python-2.6.6 : Linux
CMF-2.2 Zope-2.13 Python-2.6.6 : Linux
CMF-trunk Zope-2.13 Python-2.6.6 : Linux
[1] FAILED (failures=1) : CMF-trunk Zope-trunk Python-2.6.6 : Linux

Non-OK results
--------------

[1] UNKNOWN FAILED (failures=1) : CMF-trunk Zope-trunk Python-2.6.6 : Linux
https://mail.zope.org/pipermail/cmf-tests/2011-September/015245.html


_______________________________________________
Zope-CMF maillist - Zope-CMF [at] zope
https://mail.zope.org/mailman/listinfo/zope-cmf

See https://bugs.launchpad.net/zope-cmf/ for bug reports and feature requests


noreply at zope

Sep 15, 2011, 6:00 PM

Post #71 of 75 (4296 views)
Permalink
cmf-tests - OK: 3, UNKNOWN: 1 [In reply to]

This is the summary for test reports received on the
cmf-tests list between 2011-09-14 00:00:00 UTC and 2011-09-15 00:00:00 UTC:

See the footnotes for test reports of unsuccessful builds.

An up-to date view of the builders is also available in our
buildbot documentation:
http://docs.zope.org/zopetoolkit/process/buildbots.html#the-nightly-builds

Reports received
----------------

CMF-2.2 Zope-2.12 Python-2.6.6 : Linux
CMF-2.2 Zope-2.13 Python-2.6.6 : Linux
CMF-trunk Zope-2.13 Python-2.6.6 : Linux
[1] FAILED (failures=1) : CMF-trunk Zope-trunk Python-2.6.6 : Linux

Non-OK results
--------------

[1] UNKNOWN FAILED (failures=1) : CMF-trunk Zope-trunk Python-2.6.6 : Linux
https://mail.zope.org/pipermail/cmf-tests/2011-September/015249.html


_______________________________________________
Zope-CMF maillist - Zope-CMF [at] zope
https://mail.zope.org/mailman/listinfo/zope-cmf

See https://bugs.launchpad.net/zope-cmf/ for bug reports and feature requests


noreply at zope

Sep 16, 2011, 6:00 PM

Post #72 of 75 (4262 views)
Permalink
cmf-tests - OK: 3, UNKNOWN: 1 [In reply to]

This is the summary for test reports received on the
cmf-tests list between 2011-09-15 00:00:00 UTC and 2011-09-16 00:00:00 UTC:

See the footnotes for test reports of unsuccessful builds.

An up-to date view of the builders is also available in our
buildbot documentation:
http://docs.zope.org/zopetoolkit/process/buildbots.html#the-nightly-builds

Reports received
----------------

CMF-2.2 Zope-2.12 Python-2.6.6 : Linux
CMF-2.2 Zope-2.13 Python-2.6.6 : Linux
CMF-trunk Zope-2.13 Python-2.6.6 : Linux
[1] FAILED (failures=1) : CMF-trunk Zope-trunk Python-2.6.6 : Linux

Non-OK results
--------------

[1] UNKNOWN FAILED (failures=1) : CMF-trunk Zope-trunk Python-2.6.6 : Linux
https://mail.zope.org/pipermail/cmf-tests/2011-September/015253.html


_______________________________________________
Zope-CMF maillist - Zope-CMF [at] zope
https://mail.zope.org/mailman/listinfo/zope-cmf

See https://bugs.launchpad.net/zope-cmf/ for bug reports and feature requests


noreply at zope

Sep 17, 2011, 6:00 PM

Post #73 of 75 (4247 views)
Permalink
cmf-tests - OK: 3, UNKNOWN: 1 [In reply to]

This is the summary for test reports received on the
cmf-tests list between 2011-09-16 00:00:00 UTC and 2011-09-17 00:00:00 UTC:

See the footnotes for test reports of unsuccessful builds.

An up-to date view of the builders is also available in our
buildbot documentation:
http://docs.zope.org/zopetoolkit/process/buildbots.html#the-nightly-builds

Reports received
----------------

CMF-2.2 Zope-2.12 Python-2.6.6 : Linux
CMF-2.2 Zope-2.13 Python-2.6.6 : Linux
CMF-trunk Zope-2.13 Python-2.6.6 : Linux
[1] FAILED (failures=1) : CMF-trunk Zope-trunk Python-2.6.6 : Linux

Non-OK results
--------------

[1] UNKNOWN FAILED (failures=1) : CMF-trunk Zope-trunk Python-2.6.6 : Linux
https://mail.zope.org/pipermail/cmf-tests/2011-September/015257.html


_______________________________________________
Zope-CMF maillist - Zope-CMF [at] zope
https://mail.zope.org/mailman/listinfo/zope-cmf

See https://bugs.launchpad.net/zope-cmf/ for bug reports and feature requests


noreply at zope

Sep 18, 2011, 6:00 PM

Post #74 of 75 (4212 views)
Permalink
cmf-tests - OK: 3, UNKNOWN: 1 [In reply to]

This is the summary for test reports received on the
cmf-tests list between 2011-09-17 00:00:00 UTC and 2011-09-18 00:00:00 UTC:

See the footnotes for test reports of unsuccessful builds.

An up-to date view of the builders is also available in our
buildbot documentation:
http://docs.zope.org/zopetoolkit/process/buildbots.html#the-nightly-builds

Reports received
----------------

CMF-2.2 Zope-2.12 Python-2.6.6 : Linux
CMF-2.2 Zope-2.13 Python-2.6.6 : Linux
CMF-trunk Zope-2.13 Python-2.6.6 : Linux
[1] FAILED (failures=1) : CMF-trunk Zope-trunk Python-2.6.6 : Linux

Non-OK results
--------------

[1] UNKNOWN FAILED (failures=1) : CMF-trunk Zope-trunk Python-2.6.6 : Linux
https://mail.zope.org/pipermail/cmf-tests/2011-September/015261.html


_______________________________________________
Zope-CMF maillist - Zope-CMF [at] zope
https://mail.zope.org/mailman/listinfo/zope-cmf

See https://bugs.launchpad.net/zope-cmf/ for bug reports and feature requests


noreply at zope

Sep 19, 2011, 6:00 PM

Post #75 of 75 (4183 views)
Permalink
cmf-tests - OK: 3, UNKNOWN: 1 [In reply to]

This is the summary for test reports received on the
cmf-tests list between 2011-09-18 00:00:00 UTC and 2011-09-19 00:00:00 UTC:

See the footnotes for test reports of unsuccessful builds.

An up-to date view of the builders is also available in our
buildbot documentation:
http://docs.zope.org/zopetoolkit/process/buildbots.html#the-nightly-builds

Reports received
----------------

CMF-2.2 Zope-2.12 Python-2.6.6 : Linux
CMF-2.2 Zope-2.13 Python-2.6.6 : Linux
CMF-trunk Zope-2.13 Python-2.6.6 : Linux
[1] FAILED (failures=1) : CMF-trunk Zope-trunk Python-2.6.6 : Linux

Non-OK results
--------------

[1] UNKNOWN FAILED (failures=1) : CMF-trunk Zope-trunk Python-2.6.6 : Linux
https://mail.zope.org/pipermail/cmf-tests/2011-September/015265.html


_______________________________________________
Zope-CMF maillist - Zope-CMF [at] zope
https://mail.zope.org/mailman/listinfo/zope-cmf

See https://bugs.launchpad.net/zope-cmf/ for bug reports and feature requests

Zope cmf RSS feed   Index | Next | Previous | View Threaded
 
 


Interested in having your list archived? Contact Gossamer Threads
 
  Web Applications & Managed Hosting Powered by Gossamer Threads Inc.